ERA Ontology
type: Ontology
license: https://creativecommons.org/licenses/by/4.0/
contributor: Maarten Duhoux
  member of: ERA
contributor: Designated RINF Topical Working Groups
creator: Ghislain Atemezing
  member of: ERA
creator: Dragos Patru
  member of: ERA
description: Revision 05-06-2024: - linked with existing (updated) or new SKOS Concepts, related to the TWG RINF CCS; - included references and guidelines as in Table 5 of the RINF Application Guide. Revision 03-06-2024: - added properties for the primary and subsidiary locations - reuse the organisation ontology to address the ERA stakeholder organisations (bodies) and their roles - deprecated classes related to organisation - error corrections - added several definitions Revision 24-05-2024: - remove of the owl:FunctionalProperty from every object or data property; - addition of new classes for the purpose of the Topical Wrokgroup micro-level; - reshaping the topology layer, deprecating unused properties and renaming some of the classes - reuse of the time ontology for addressing the validity and applicability; - remove of the axiom era:TopologicalObject as subclass of era:Feature; - changing the domains of multiple data and object properties to subclasses of era:TechnicalCharacteristics; - removed some of the relations between tracks, sidings, tunnels, etc.; - deprecated the properties addressing the validity; - TODO: deprecate unused properties from version 3.0.0; Revision 18-04-2024: - updated as per results of the Topical Working Group RINF-CCS (Draft report 0.2); - include upcoming remarks from TWG members (inclusing those as documented in Report 0.3); - linked with existing (updated) or new SKOS Concepts, related to the TWG RINF CCS; - included references and guidelines as in Table 5 of the RINF Application Guide.
issued: 2024-04-18
modified: 2024-04-18
modified: 2024-05-24
modified: 2024-06-03
modified: 2024-06-05
publisher: European Union Agency for Railways
comment: This is the human and machine readable Ontology governed by the European Union Agency for Railways (https://www.era.europa.eu/). It represents the concepts and relationships linked to the sectorial legal framework and the use cases under the AgencyÂ´s remit, as described in the Commission Implementing Regulation (EU) [to be updated after publication] on the common specifications for the register of railway infrastructure [to be updated after publication]. Currently, this Ontology covers the European railway infrastructure and the vehicles types authorized to operate over it. It is a semantic/browsable representation of the RINF application guide (https://www.era.europa.eu/sites/default/files/registers/docs/rinf_application_guide_for_register_en.pdf) and ERATV application guide (https://www.era.europa.eu/sites/default/files/registers/docs/iu-eratv_application_guide_for_register_2016-797_en.pdf) that were built by domain experts in the RINF and ERATV working parties. The Ontology also includes the routebook concepts described in appendix D2 "Elements the infrastructure manager has to provide to the railway undertaking for the Route Book" as presented in the Commission Implementing Regulation (EU) [to be updated after publication] 2019/773 of 16 May 2019 on the technical specification for interoperability relating to the operation and traffic management subsystem of the rail system within the European Union and [to be updated after publication] and the Appendix D3 [to be updated after publication].
imports: geosparql#
prior version: https://git.fpfis.eu/datateam/ERA/era-vocabulary/-/releases/v3.0.0
version info: v3.1.0
version URI: https://git.fpfis.eu/datateam/ERA/era-vocabulary/-/releases/v3.1.0

Aggregated Object
type: Class
comment: An aggregated object is an infrastructure object defined at a higher level of granularity, containing at least one basic object. Example: in one operational point we can find several tracks, switches, signals, etc.
subclass of: Infrastructure object

Applicability
type: Class
comment: Applicability interval defines the date interval in which a characteristic of an infrastructure element is applicable. This interval can be applied for any of the technical characteristics or general information of infrastructure elements. This helps identifying planned changes applied to technical parameters over time.

Area Location
type: Class
comment: Represents a geographical representation of a polygonal area. Example: non-stopping area,cross section area, area of implementation of GPRS etc.
subclass of: Base Location

Base Location
type: Class
comment: It represents different types of geographical locations. Geographical coordinates are provied according to the standard World Geodetic System (WGS84).
subclass of: ERA Feature

Basic Object
type: Class
comment: A basic object is the minimal representation of an infrastructure object. Examples: junctions, tracks, switches, tunnels, etc.
subclass of: Infrastructure object

Body
type: Class
created: 2024-06-03
comment: Is an organisation or a physical person
subclass of: Class
  union of: Organization
  union of: Person
disjoint with: Organisation Role

Bridge
type: Class
comment: It is a structure constructed for the exclusive purpose of carrying railroad traffic across an obstruction. It can be used for defining non-stopping areas, big metal mass, resistance to traffic load etc.
subclass of: Basic Object
disjoint with: Junction
disjoint with: Level crossing
disjoint with: Platform edge
disjoint with: Siding
disjoint with: Signal
disjoint with: Signals Grid
disjoint with: Switch
disjoint with: Running track
disjoint with: Tunnel

CCS Subsystem
type: Class
subclass of: Technical Characteristics

Certificate
type: Class
created: 2022-06-15
modified: 2022-06-15
comment: TODO review:Certificate of a vehicle type. Can be in one of the following states: Amended, New, Suspended, Withdrawn.
term status: stable

Contact Line System
type: Class
RINF index: 1.1.1.2.2
created: 2021-08-04
modified: 2021-08-04
comment: System that is used to transmit electrical energy to road or rail vehicles.
term status: stable

ERA Document
type: Class
created: 2024-04-23
comment: Document in any of the ERA systems, e.g. reference document in RINF.
subclass of: Document
term status: stable

ETCS
type: Class
RINF index: 1.1.1.3.2
created: 2021-08-07
modified: 2021-08-07
comment: TSI compliant train protection system ERTMS / ETCS application level and baseline related to the track side equipment.
term status: stable

Energy Subsystem
type: Class
subclass of: Technical Characteristics

ERA Feature
type: Class
created: 2022-07-07
modified: 2022-10-27
comment: Class that encompasses the features that are part of the physical infrastructure (class InfrastructureObject) and the topological objects (class TopologicalObject). It is a subclass of the geographical Feature class that has a spatial representation.
subclass of: Feature

Section with train detection limitation
type: Class
created: 2023-04-05
comment: Specific for route compatibility check on French network. Sections with: -1 Tonnage circulated per track is inferior to 15000 tons/day/track -2 Directional Interlocking -3 45-second delay for directional interlocking -4 Installation with track circuit announcement -5 Absence of a shunting assistance pedal in the normal direction of circulation for non-reversible double track lines -6 Absence of a shunting assistance pedal regardless of the direction of traffic for single track lines and tracks for two way working -7 Absence of a pedal announcement mechanism -8 45-second delay for specific announcement reset devices
term status: stable

Infra Subsystem
type: Class
subclass of: Technical Characteristics

Infrastructure manager
type: Class
is replaced by: Body
comment: (deprecated) The infrastructure manager owns and operates the railway network and related infrastructure.
subclass of: Organization
deprecated: true
scope note: See point (2) of Article 3 of Directive 2012/34/EU of the European Parliament and of the Council establishing a single European railway area.

Infrastructure object
type: Class
created: 2022-07-07
modified: 2022-10-27
comment: This class encompasses all those classes that represent features that are implemented in the European railway infrastructure. It is a subclass of the ERA Feature that has a spatial representation. It covers tracks, platforms, signals, tunnels, operational points, and sections of line. A feature that belongs to the infrastructure can be abstracted (hasAbstraction) as a topological object. It also is related to the infrastructure manager through the property infrastructureMgr.
subclass of: ERA Feature

Junction
type: Class
comment: A junction is where 2 or more railway tracks converge or diverge. This implies a physical connection between the tracks of the two routes
subclass of: Basic Object
disjoint with: Level crossing
disjoint with: Platform edge
disjoint with: Siding
disjoint with: Signal
disjoint with: Signals Grid
disjoint with: Switch
disjoint with: Running track
disjoint with: Tunnel

Level crossing
type: Class
comment: A level crossing is an intersection where a railway line crosses a road or a path at the same level. It can be used for the implementation of the ETCS trackside or to identify potential collision scenarios
subclass of: Basic Object
disjoint with: Platform edge
disjoint with: Siding
disjoint with: Signal
disjoint with: Signals Grid
disjoint with: Switch
disjoint with: Running track
disjoint with: Tunnel

Railway location
type: Class
created: 2021-01-29
modified: 2021-01-29
comment: TODO review: A reference to a specific national railway line.
term status: stable
alternative label: Line reference

Linear Element
type: Class
comment: This class represents a node in the topological graph.
subclass of: Topological Object

Linear Element Link
type: Class
RINF index: 1.1.1.0.1.2
comment: This class represents a directed edge in the topological graph
subclass of: Topological Object

Linear Element Link Condition
type: Class
subclass of: Topological Object

Linear Location
type: Class
comment: Geographical representation of a curvi-linear topology element. Example: tracks, tunnels, bridges, platform edges etc.
subclass of: Base Location

Load capability
type: Class
created: 2023-03-14
comment: A combination of the line category and speed at the weakest point of the track. Each track can have several load capability (structured) values, and each one has values for load model line category and load model speed.
comment: This class together with properties loadCapabilityLineCategory and loadCapabilitySpeed replaces the previous loadCapability SKOS property.
term status: stable

Manufacturer
type: Class
created: 2020-11-19
modified: 2020-11-19
modified: 2024-06-03
comment: (deprecated) Replaced by the era:Body class and era:manufacturer property. A company or organization that manufactures vehicles.
subclass of: Organization
deprecated: true
term status: stable

Maximum magnetic field
type: Class
XML name: CCD_ACMagFieldMax
RINF index: 1.1.1.3.4.2.3
RINF index: 1.2.1.1.3.2.3
created: 2023-03-14
requires: The MaximumMagneticField class is applicable for axle counters.
source: index077 - ERA ERTMS 033281 v5.pdf
comment: The maximum magnetic field limits allowed for axle counters (in dB µA/m) for a defined frequency band. It should be provided in 3 directions.
term status: stable

Maximum speed and cant deficiency
type: Class
created: 2023-04-05
comment: Combination of maximum speed and maximum cant deficiency for which the vehicle was assessed.
term status: stable

Min axle load vehicle category
type: Class
created: 2023-01-25
modified: 2023-03-14
comment: Deprecated according to the ammendment to the Regulation (EU) 2019/777. Represents information that indicates the load given in tons depending of the category of vehicle. Its properties are minAxleLoadVehicleCategory and minAxleLoad.
deprecated: true
term status: stable

Minimum Vehicle Impedance
type: Class
created: 2024-05-30
requires: The MinVehicleImpedance class is applicable for track circuits.
source: index077 - ERA ERTMS 033281 v5.pdf
comment: Impedance as defined in the TSI CCS (Annex I, Appendix A, Table A.2 -Index 77). Minimum vehicle impedance (between wheels and pantograph) (only for vehicles equipped for 1500V or 3000V DC). Per Voltage: [1500]: [CCCC]+[ZZZZ], with input capacitance [CCCC](Cin) and input impedance [ZZZZ](Zin) [3000]: [CCCC]+[ZZZZ], idem.
term status: stable

National railway line
type: Class
created: 2021-01-25
modified: 2021-08-03
comment: Railway line within a member state. A line is a sequence of one or mores ections of line, which connects operational points and which may consist of several tracks used for regular railway operation.
subclass of: Aggregated Object
disjoint with: Primary Location
term status: stable

Network
type: Class
comment: A group of network resources for different purposes. It can be group of elements belonging to corridors, to one IM, to high speed lines, etc. There is no restriction on how elements should be groupped, it is the IM to decide the refinement of the information to be provided.

Network Resource
type: Class
subclass of: Infrastructure object

Operational Point
type: Class
Appendix D2 index: 2.1.2
RINF index: 1.2
created: 2020-07-29
modified: 2022-07-07
comment: An operational point (OP) means any location for train service operations, where train services may begin and end or change route, and where passenger or freight services may be provided; operational point also means any location at boundaries between Member States or infrastructure managers.
subclass of: Aggregated Object
term status: stable

Organisation Role
type: Class

Orientation
type: Class
comment: Represents the orientation of a railway object in relation to a carrier linear element. It can be described by direction, orientation and side.

Phase info
type: Class
created: 2023-04-05
comment: Indication of required several information on phase separation.
term status: stable

Platform edge
type: Class
RINF index: 1.2.1.0.6
created: 2021-08-02
modified: 2023-11-10
comment: Platform for the purpose of RINF is understood as a platform edge. A platform concerns only the part of the structure neighbouring to the track (interfaced with trains).
subclass of: Basic Object
disjoint with: Siding
disjoint with: Signal
disjoint with: Signals Grid
disjoint with: Switch
disjoint with: Running track
disjoint with: Tunnel
term status: stable

Position
type: Class
comment: Describes the linear position of an infrastructure object

Primary Location
type: Class
comment: Primary Location is a place used by IM to define a path for a train in TAF/TAP TSI framework/messages. This location is a rail point inside the rail network where train starts, ends, stops, or runs through or change line. This location must be managed by an Infrastructure Manager (IM) identified by company code. Primary locations are for example: stations, yards, halts, handover points, border points, open access terminals. Primary locations are identified by single and unique Primary Location codes. Primary location code is allocated based on processes defined by national entity. Primary location codes are used in any kind of TAF/TAP communication. See: Handbook 9.3.3 / page 60
subclass of: Aggregated Object
disjoint with: Radio Block Center

Radio Block Center
type: Class
comment: ETCS trackside centralised unit controlling ETCS train movements in level 2. A centralised safety unit that receives train position information via radio and sends movement authorities via radio to trains.
subclass of: Aggregated Object

Requirements for raised pantographs
type: Class
RINF index: 1.1.1.2.3.3
created: 2023-04-05
comment: Indication of maximum number of raised pantographs per train allowed and minimum spacing centre line to centre line of adjacent pantograph heads, expressed in metres, at the given speed. Each track can have several raised pantographs per train allowed (structured) values, and each one has values for number of pantographs, minimum distance between pantographs, in metres, and speed considered in km/h.
comment: This parameter gives the information about the number of pantographs and the distance between them at a given speed for which the Overhead Contact Line (OCL) has been designed. As for different speeds different combinations of number of pantographs and distance between them may exist, so this parameter can be repeated to present all of them.
term status: stable

Referent
type: Class
comment: A class to position a railway element in relation to a fixed reference point. For example a kilometric post.

Section Of Line
type: Class
Appendix D2 index: 2.1.1
RINF index: 1.1
source: oj
created: 2021-04-02
modified: 2022-07-07
comment: A section of line means the part of line between adjacent operational points and may consist of several tracks.
subclass of: Aggregated Object
subclass of: Restriction
  on class: National railway line
  on property: national line
  qualified cardinality: 1
subclass of: Restriction
  on class: Operational Point
  on property: Operational point at end of section of line
  qualified cardinality: 1
subclass of: Restriction
  on class: Operational Point
  on property: Operational point at start of section of line
  qualified cardinality: 1
term status: stable

Siding
type: Class
RINF index: 1.2.2
created: 2021-08-10
modified: 2022-10-27
source: Official Journal of the European Union L 139 I/85
comment: Sidings are all those tracks where running trains in service movements ends and which are not used for operational routing of a train.
subclass of: Basic Object
disjoint with: Signal
disjoint with: Signals Grid
disjoint with: Switch
disjoint with: Running track
disjoint with: Tunnel
term status: stable
definition: Siding Any track(s) within an operational point which is not used for operational routing of a train.

Signal
type: Class
RINF index: 1.2.1.0.8
source: https://eur-lex.europa.eu/eli/reg_impl/2019/773/2023-09-28
created: 2021-04-01
modified: 2022-10-27
comment: A railway signal is an installation next to the railway track for signalling the maximum allowed speed in the next block section to the train driver. Definition RSM: Apparatus by means of which a conventional visual or acoustic indication is given, generally concerning the movements of railway vehicles.
subclass of: Basic Object
disjoint with: Signals Grid
disjoint with: Switch
disjoint with: Running track
disjoint with: Tunnel
term status: stable

Signals Grid
type: Class
comment: Group of switches and crossings within an Operational Point with which the route protection function is realized by a group of Signals belonging together from an operational standpoint. The switches' position in a SignalsGrid are controlled together by the interlocking during normal operation and else by safety procedures.
subclass of: Basic Object
disjoint with: Switch
disjoint with: Running track
disjoint with: Tunnel

Special area
type: Class
annex D2 index: 3.2.4
annex D2 index: 3.2.5
source: oj
created: 2022-10-27
created: 2024-04-18
comment: TODO review: Encompasses all those areas (outside of the operational gauge) or sections (those in tunnels excluded) which influence operation in the gauge itself, such as - safe areas, - restricted areas (non-stopping areas or industrial risk locations). Non-stopping Area: Area defined by the Infrastructure Manager where it may not be safe or suitable to stop a train. Safe Area: Area defined by the Infrastructure Manager where it is safe or suitable to stop and evacuate a train. Industrial Risk Area: locations where it is dangerous for the driver to step out. For these areas in tunnels, use era:SpecialTunnelArea.
subclass of: Infrastructure object
term status: stable

Special tunnel area
type: Class
annex D2 index: 3.2.3
source: oj
created: 2022-10-27
comment: TODO review: Area or location within a tunnel where there are - a safe area: a walkway, evacuation and rescue points; - a restricted area (non-stopping area or industrial risk location in a tunnel).
subclass of: Special area
term status: stable

Spot Location
type: Class
comment: Geographical representation of elements which are located as a point of the ground. Example: signal
subclass of: Base Location

Subset with common characteristics
type: Class
created: 2022-11-04
modified: 2023-03-14
comment: A set of common technical characteristics that is shared by different infrastructure objects. The set of parameters may not be restricted to only one railway subsystem, but it can include common characteristics from each one of them (infrastructure, energy, track-side CCS)
term status: stable

Subsidiary location
type: Class
comment: Subsidiary location must be linked to a Primary Location and specifies in more detailed way part, attributes, or usage of Primary location. It may be also a non-rail point or a rail point that is not managed by an Infrastructure Manager (IM). It may be defined by entity having company code according to their needs. The Subsidiary location is optional and dependent upon business needs.
subclass of: Restriction
  on class: Primary Location
  on property: belongs to
  qualified cardinality: 1

Switch
type: Class
source: oj
comment: A unit of track comprising two fixed rails (stock rails) and two movable rails (switch rails) used to direct vehicles from one track to another track.
subclass of: Basic Object
disjoint with: Running track
disjoint with: Tunnel
term status: stable

System separation info
type: Class
created: 2023-04-05
comment: Indication of required several information on system separation.
term status: stable

existence and TSI compliance of rules for magnetic fields emitted by a vehicle
type: ObjectProperty
XML name: CEI_TSIMagneticFields
in SKOS Concept Scheme: TSIExistenceAndCompliances
RINF index: 1.1.1.3.9.1
RINF index: 1.2.1.1.8.1
created: 2021-08-09
is replaced by: Existence and TSI compliance of rules for magnetic fields emitted by a vehicle
modified: 2021-09-12
modified: 2024-04-25
comment: Indication whether rules exist and are compliant with the TSI.
domain: CCS Subsystem
range: Concept
deprecated: true
term status: stable

existence and TSI compliance of limits in harmonics in the traction current of vehicles
type: ObjectProperty
XML name: CEI_TSITractionHarmonics
in SKOS Concept Scheme: TSICompliances
RINF index: 1.1.1.3.9.2
RINF index: 1.2.1.1.8.2
created: 2021-08-09
is replaced by: Existence and TSI compliance of limits in harmonics in the traction current of vehicles
modified: 2021-09-12
comment: Indication whether rules exist and are compliant with the TSI.
domain: CCS Subsystem
range: Concept
deprecated: true
term status: stable

Technical Characteristics
type: Class

Temporal Feature
type: Class
subclass of: TemporalDuration
subclass of: TemporalEntity

Topological Object
type: Class
created: 2022-05-04
comment: Top level class for the the track network described as a topological node edge model
term status: unstable

Running track
type: Class
RINF index: 1.1.1
created: 2020-07-29
modified: 2022-07-07
comment: A running track means any track used for train service movements; passing loops and meeting loops on plain line or track connections only required for train operation are not published
subclass of: Basic Object
disjoint with: Tunnel
term status: stable

Train Detection System
type: Class
RINF index: 1.1.1.3.4
created: 2021-08-07
modified: 2021-08-07
comment: Safety system used to detect the presence of vehicles on the railway track.
term status: stable

Tunnel
type: Class
RINF index: 1.2.2.0.5
source: https://eur-lex.europa.eu/eli/reg/2014/1303/2024-01-29
created: 2020-07-29
modified: 2022-07-07
comment: A railway tunnel is an excavation or a construction around the track provided to allow the railway to pass for example higher land, buildings or water.
subclass of: Basic Object
term status: stable

Vehicle
type: Class
created: 2020-11-22
modified: 2020-11-22
comment: A specific vehicle or wagon able and allowed to operate over railway infrastructure.
term status: stable

Vehicle Keeper
type: Class
created: 2020-11-23
modified: 2020-11-23
modified: 2024-04-18
modified: 2024-06-03
comment: (deprecated) The natural or legal person that, being the owner of a vehicle or having the right to use it, exploits the vehicle as a means of transport and is registered as such in a vehicle register referred to in Article 47 of (EU)2016/797.
subclass of: Organization
deprecated: true
term status: stable

Vehicle Type
type: Class
created: 2020-07-29
modified: 2020-07-29
modified: 2024-04-18
modified: 2024-06-03
comment: A vehicle type that has been authorized to operate on the EU railway infrastructure. Type means a vehicle type defining the basic design characteristics of the vehicle as covered by a type or design examination certificate described in the relevant verification module. Basic design characteristics means the parameters that are used to identify the vehicle type as specified in the issued vehicle type authorisation and recorded in the European Register of Authorised Vehicle Types (‘ERATV’). The above mentioned certificate should be documented using era:certificate.
subclass of: Restriction
  on class: Body
  on property: manufactured by
  qualified cardinality: 1
term status: stable

XML name
type: AnnotationProperty
created: 2023-05-26
comment: Corresponding XML name as indicated in the RINF application guide: https://www.era.europa.eu/sites/default/files/registers/docs/rinf_application_guide_for_register_en.pdf

Acceleration allowed near level crossing
type: DatatypeProperty
XML name: IHS_AccelerationLevelCrossing
RINF index: 1.1.1.1.7.3
created: 2021-08-03
modified: 2024-01-08
comment: Existence of limit for acceleration of train if stopping or recovering speed close to a level crossing expressed in a specific reference acceleration curve.
domain: Infra Subsystem
range: string
term status: stable

Documents available by the IM relating to braking performance
type: ObjectProperty
XML name: CBP_BrakePerfDocRef
RINF index: 1.1.1.3.11.3
used in RCC calculations: true
created: 2020-08-24
modified: 2024-01-08
modified: 2024-04-23
comment: Electronic document available in two EU languages from the IM stored by the Agency providing additional information as defined in point (2) of point 4.2.2.6.2 of TSI OPE.
domain: CCS Subsystem
range: ERA Document
term status: stable
change note: Change from datatype property to object property in order to point to the class Document (reference document)

allocation company
type: ObjectProperty
domain: Subsidiary location
label: the organisation in charge to allocate the code for the subsidiary location
range: Body

Vehicle Type - Alternative name
type: DatatypeProperty
ERATV index: 1.2
created: 2020-07-29
modified: 2020-07-29
modified: 2024-04-18
comment: Alternative name of a vehicle type.
domain: Vehicle Type
range: string
term status: stable

Altitude range
type: DatatypeProperty
ERATV index: 4.3.2
created: 2021-08-26
modified: 2021-08-26
comment: Altitude range.
domain: Vehicle Type
range: string
term status: stable

Altitude range detail
type: DatatypeProperty
ERATV index: 4.3.2.1
created: 2021-08-26
modified: 2021-08-26
comment: Altitude range value for 'X' if value 'AX' is selected in altitude range.
domain: Vehicle Type
range: integer
term status: stable

Appendix D2 index
type: AnnotationProperty
comment: The index of a vocabulary term in Appendix D2 Elements the infrastructure manager has to provide to the railway undertaking for the Route Book from the document Commission Implementing Regulation (EU) 2019/773 of 16 May 2019 on the technical specification for interoperability relating to the operation and traffic management subsystem of the rail system within the European Union and repealing Decision 2012/757/EU.

Appendix D3 index
type: AnnotationProperty
created: 2022-11-04
comment: The index of a vocabulary term in Appendix D3 ERTMS trackside engineering information relevant to operation that the infrastructure manager shall provide to the railway undertaking.
term status: stable

applicability
type: ObjectProperty
domain: Applicability
range: Technical Characteristics

Range of use of the platform boarding aid
type: DatatypeProperty
XML name: IPL_AreaBoardingAid
RINF index: 1.2.1.0.6.7
Unit of measure: MilliM
created: 2021-08-02
modified: 2023-01-20
comment: Information of the train access level for which the boarding aid can be used. Data is presented as the vertical difference that is overcome by the platform boarding aid in millimetres. The value “0” means that the platform is not equipped with a platform boarding aid.
domain: Platform edge
range: integer
term status: stable

Existence of platform assistance for starting train
type: DatatypeProperty
XML name: IPL_AssistanceStartingTrain
RINF index: 1.2.1.0.6.6
created: 2021-08-02
modified: 2021-08-02
comment: Indication of existence of equipment or staff supporting the train crew in starting the train.
domain: Platform edge
range: boolean
term status: stable

ATO communication system
type: ObjectProperty
XML name: ATO_CommSystem
Appendix D2 index: 3.4.9
in SKOS Concept Scheme: ATOCommSystem
RINF index: 1.1.1.3.13.3
RINF index: 1.2.1.1.10.3
created: 2023-03-14
modified: 2024-04-18
relation: ETCS baseline
requires: Parameter only applicable when ETCS Baseline > 4 MR1 and ATO is implemented
comment: Supported ATO communication systems from trackside.
domain: CCS Subsystem
range: Concept
term status: unstable

(Deprecated) ATO error corrections required for the on-board. Use: errorCorrectionsOnboard
type: DatatypeProperty
RINF index: 1.1.1.3.13.4
created: 2023-03-14
modified: 2024-04-18
comment: List of unacceptable errors impacting the IM network that are required to be solved in the on-board ATO according to the CCS TSI point 7.2.10.3 specification maintenance point.
domain: CCS Subsystem
range: anyURI
deprecated: true
term status: deprecated

ATO Grade of Automation
type: ObjectProperty
XML name: ATO_GradeAutomation
Appendix D2 index: 3.4.8
in SKOS Concept Scheme: ATOGradeOfAutomation
RINF index: 1.1.1.3.13.1
RINF index: 1.2.1.1.10.1
created: 2023-03-14
modified: 2024-04-18
relation: ETCS baseline
requires: Parameter only applicable when ETCS Baseline > 4 MR1 and ATO is implemented
comment: ATO grade of automation installed lineside.
domain: CCS Subsystem
range: Concept
term status: stable

ATO System version
type: ObjectProperty
XML name: ATO_GradeAutomation
Appendix D2 index: 3.4.8
in SKOS Concept Scheme: ATOSystemVersions
RINF index: 1.1.1.3.13.2
RINF index: 1.2.1.1.10.2
created: 2023-03-14
modified: 2024-04-18
relation: ETCS baseline
requires: Parameter only applicable when ETCS Baseline > 4 MR1 and ATO is implemented
source: oj
comment: ATO system version according to the specification referenced in TSI CCS (4.2.19).
domain: CCS Subsystem
range: Concept
term status: stable

authorized country
type: ObjectProperty
in SKOS Concept Scheme: country
created: 2020-09-30
modified: 2020-09-30
comment: Indicates the country(ies) in where a vehicle type has been authorized to operate.
domain: Vehicle Type
range: Concept
term status: stable

Automatic dropping device required
type: DatatypeProperty
XML name: ERS_AutoDropRequired
RINF index: 1.1.1.2.5.3
used in RCC calculations: true
created: 2020-08-25
modified: 2021-09-12
comment: Indication of whether an automatic dropping device (ADD) required on the vehicle.
domain: Energy Subsystem
range: boolean
term status: stable

axle bearing condition monitoring
type: ObjectProperty
ERATV index: 4.9.2
in SKOS Concept Scheme: AxleBearingMonitoring
created: 2020-08-24
modified: 2021-08-02
comment: Axle bearing condition monitoring.
domain: Vehicle Type
range: Concept
term status: stable

Axle spacing
type: DatatypeProperty
ERATV index: 4.5.3.4
created: 2020-08-24
modified: 2021-08-26
comment: Position of the axles along the unit. a: Distance between axles; b: Distance from end axle to the end of the nearest coupling plane; c: distance between two inside axles.
domain: Vehicle Type
range: string
term status: stable

belongs to
type: ObjectProperty
domain: Network Resource
range: Network

Big Metal Mass
type: DatatypeProperty
type: FunctionalProperty
XML name: CPE_BigMetalMass
Appendix D2 index: 3.4.10
RINF index: 1.1.1.3.2.18
RINF index: 1.2.1.1.1.18
created: 2023-03-14
modified: 2024-01-08
modified: 2024-04-18
requires: Only applicable when selected value for 1.1.1.3.2.1 (ETCS present).
source: oj
comment: Indication of existence of metal mass in the vicinity of the location, susceptible of perturbating the reading of balises by the on-board system.
domain: CCS Subsystem
range: boolean
term status: stable

Boarding aids
type: DatatypeProperty
ERATV index: 4.12.3.2
created: 2021-08-31
modified: 2021-08-31
comment: Description of any integrated boarding aids (if provided).
domain: Vehicle Type
range: string
term status: stable

border point of
type: ObjectProperty
created: 2023-01-20
comment: TODO: review. Relates the information that each country maintains on a border point, to the operational point that represents the general information on the border point.
domain: Operational Point
range: Operational Point
inverse of: Border point information per country
term status: stable

Brake weight percentage
type: DatatypeProperty
ERATV index: 4.7.6
created: 2020-08-24
modified: 2021-08-26
comment: Brake weight percentage (lambda) or Braked mass.
domain: Vehicle Type
range: string
term status: stable

Is bridge
type: DatatypeProperty
domain: Running track
range: boolean
term status: stable
definition: Whether or not a track is associated with a bridge.

Canonical URI
type: AnnotationProperty
created: 2022-12-13
modified: 2024-02-06
comment: The canonical URI is defined for each instance of an Infrastructure element, e.g. section of line, operational point, track, tunnel, siding. Objects of the infrastructure generated through RML mappings include (when provided) their validity start and end dates. With its identifier, plus all identifiers of its "parent" elements, and its validity dates, a hash URI is generated. The canonical URI is the element's URI with its identifiers and without the validity dates. All of the hash URIs of an element point to its canonical URI. Additionally, SoLs point to the canonical URIs of their start OP and end OP.
domain: Infrastructure object
range: anyURI

Cant defficiency
type: DatatypeProperty
ERATV index: 4.6.1
created: 2021-08-26
modified: 2021-08-26
comment: Cant deficiency (maximum uncompensated lateral acceleration) for which the vehicle has been assessed. For dual gauge vehicles values for each gauge have to be indicated.
domain: Vehicle Type
range: integer
term status: stable

Cant deficiency
type: DatatypeProperty
XML name: ITP_CantDeficiency
RINF index: 1.1.1.1.4.2
Unit of measure: MilliM
used in RCC calculations: true
created: 2020-08-24
modified: 2021-09-10
comment: Maximum cant deficiency expressed in millimetres defined as difference between the applied cant and a higher equilibrium cant the line has been designed for.
domain: Infra Subsystem
range: integer
term status: stable

cant deficiency used for the basic SSP
type: ObjectProperty
type: FunctionalProperty
XML name: CPE_SSPUsesCantDef
Appendix D3 index: 1.3
in SKOS Concept Scheme: CantDeficiencies
RINF index: 1.1.1.3.2.14
RINF index: 1.2.1.1.1.14
created: 2023-03-14
modified: 2024-01-08
modified: 2024-04-18
requires: Only applicable when selected value for 1.1.1.3.2.1 (ETCS present).
source: oj
comment: Essential information for drivers of trains with a worse (lower) tolerated cant deficiency than those for which the ETCS trackside provides SSP (Static Speed Profiles) in conjunction with parameter "Other Cant Deficiency train categories for which the ETCS trackside is configured to provide SSP". Subset-026 (3.11.3.2.1.1) definition: a) The “Cant Deficiency” SSP categories: the cant deficiency value assigned to one category shall define the maximum speed, determined by suspension design, at which a particular train can traverse a curve and thus can be used to set a specific speed limit in a curve with regards to this category.
domain: CCS Subsystem
range: Concept
term status: stable

carrier object
type: ObjectProperty
comment: it points to the basic object relative to which the subject basic object has an orientation
domain: Position
range: Basic Object

Vehicle category
type: ObjectProperty
ERATV index: 1.4
in SKOS Concept Scheme: Categories
created: 2020-07-29
modified: 2021-08-03
comment: Vehicle category.
domain: Vehicle Type
range: Concept
term status: stable

Catenary max rated current
type: DatatypeProperty
ERATV index: 4.10.3
created: 2021-08-31
modified: 2021-08-31
comment: Maximum rated current from the catenary (to be indicated for each electrical energy supply system the vehicle is equipped for), given in A.
domain: Vehicle Type
range: double
term status: stable

Certificate
type: ObjectProperty
created: 2022-06-15
modified: 2022-11-15
modified: 2024-04-18
comment: For this Vehicle Type, the type or design examination certificate described in the relevant verification module as issued by Notified Bodies, supporting the EC Declaration(s) of Verification for the subsystems in scope of the type's authorisation by an authorizing entity.
domain: Vehicle Type
range: Certificate
term status: stable

Company code category
type: ObjectProperty
in SKOS Concept Scheme: CompanyCodeCategories
created: 2023-04-04
comment: TODO review if used or necessary: Category of a Railway company. Can be Infrastructure, Freight or Passenger.
range: Concept
term status: stable

Document with the procedure(s) for static and dynamic route compatibility checks
type: ObjectProperty
XML name: IPP_StructureCheckDocRef
RINF index: 1.1.1.1.2.4.4
used in RCC calculations: true
created: 2023-03-14
modified: 2024-04-23
comment: Electronic document available in two EU languages from the IM stored by the Agency with: - precise procedures for the static and dynamic route compatibility checks; Or - relevant information for carrying out the checks for specific structures.
domain: Infra Subsystem
range: ERA Document
term status: stable
change note: Change from datatype property to object property in order to point to the class Document (reference document)

Compliance of the tunnel with TSI INF
type: DatatypeProperty
XML name: ITU_TSITunnel
RINF index: 1.1.1.1.8.8.1
created: 2021-08-03
modified: 2024-01-08
comment: Compliance of the tunnel with TSI INF at the maximum permitted speed.
domain: Tunnel
range: boolean
term status: stable

Composite brake block retrofitted
type: DatatypeProperty
created: 2020-11-23
modified: 2020-11-23
comment: Indicates if a vehicle's composite brake block is retrofitted
domain: Vehicle
range: boolean
term status: stable

condition
type: ObjectProperty
comment: the conditions of use of the link between the linear elements
domain: Linear Element Link
range: Linear Element Link Condition

Permission for regenerative braking
type: DatatypeProperty
type: FunctionalProperty
XML name: ECS_RegenerativeBraking
Appendix D2 index: 3.3.7
RINF index: 1.1.1.2.2.4
used in RCC calculations: true
created: 2020-08-24
modified: 2023-01-20
comment: Indication whether regenerative braking is permitted, not permitted, or permitted under specific conditions.
domain: Contact Line System
range: boolean
term status: stable

Conditions applying in regards to regenerative braking
type: DatatypeProperty
XML name: ECS_RegBrakingConditions
Appendix D2 index: 3.3.7
RINF index: 1.1.1.2.2.4.1
created: 2022-11-10
modified: 2023-03-14
modified: 2024-04-18
requires: When `not electrified` is chosen in parameter 1.1.1.2.2.1.1, then this parameter is not applicable.
source: oj
source: https://eur-lex.europa.eu/legal-content/EN/TXT/HTML/
comment: Name and/or reference of the document specifying the conditions applying in regards to regenerative braking.
domain: Contact Line System
range: anyURI
term status: stable

Permitted conditions for charging electric energy storage for traction purposes at standstill
type: DatatypeProperty
RINF index: 1.2.1.0.7.2
created: 2023-03-14
comment: Conditions set by IMs according to a standardised document.
domain: Contact Line System
range: anyURI
term status: stable

Special technical conditions required to switch over between ERTMS/ETCS and Class B systems
type: DatatypeProperty
XML name: CTS_SwitchProtectAB
Appendix D2 index: 3.4.3
RINF index: 1.1.1.3.8.3
RINF index: 1.2.1.1.7.3
created: 2022-10-28
modified: 2023-03-14
modified: 2024-04-18
source: oj
comment: Name and/or reference of the document specifying the Special technical conditions required to switch over between ERTMS/ETCS and Class B systems.
domain: CCS Subsystem
range: string
term status: stable

Special conditions to switch over between different class B train protection, control and warning systems
type: DatatypeProperty
XML name: CTS_SwitchProtectConditions
Appendix D2 index: 3.4.2
RINF index: 1.1.1.3.8.1.1
RINF index: 1.2.1.1.7.1.1
created: 2022-10-28
source: oj
comment: Conditions to switch over between different class B train protection, control and warning systems.
domain: CCS Subsystem
range: string
term status: stable

Conditions train formation
type: DatatypeProperty
ERATV index: 4.1.4
created: 2021-08-25
modified: 2021-08-25
comment: Conditions of use regarding train formation.
domain: Vehicle Type
range: string
term status: stable

conditions for use of reflective plates
type: ObjectProperty
RINF index: 1.1.1.1.7.12.1
created: 2023-03-14
comment: Details of any conditions for using the reflective plates on freight corridors. Specific case for Portugal and Spain until 1.1.2025 and Belgium and France until 1.1.2026.
domain: Infra Subsystem
range: Concept
term status: unstable

contact line system
type: ObjectProperty
created: 2020-08-24
modified: 2021-09-11
comment: Contact line system present in the section of line.
domain: Energy Subsystem
range: Contact Line System
term status: stable

type of contact line system
type: ObjectProperty
XML name: ECS_SystemType
in SKOS Concept Scheme: ContactLineSystems
RINF index: 1.1.1.2.2.1.1
used in RCC calculations: true
created: 2021-08-06
modified: 2021-08-06
comment: Indication of the type of the contact line system.
domain: Contact Line System
range: Concept
term status: stable

permitted contact strip material
type: ObjectProperty
XML name: EPA_StripMaterial
ERATV index: 4.10.10
in SKOS Concept Scheme: ContactStripMaterials
RINF index: 1.1.1.2.3.4
used in RCC calculations: true
created: 2020-08-25
modified: 2021-09-12
comment: Indication of which contact strip materials are permitted to be used.
domain: Class
  union of: Energy Subsystem
  union of: Vehicle Type
range: Concept
term status: stable

Contact strip material metallic content
type: DatatypeProperty
XML name: EPA_StripMaterial
RINF index: 1.1.1.2.3.4
used in RCC calculations: true
created: 2023-01-25
comment: In case that the value of the property era:contactStripMaterial is "impregnated carbon", it is the metallic content in % (this value must be added). This is the maximum percentage allowed.
domain: Energy Subsystem
range: integer
term status: stable

container handling flag
type: DatatypeProperty
created: 2024-06-03
domain: Primary Location
range: boolean

Cross section area
type: DatatypeProperty
XML name: ITU_CrossSectionArea
RINF index: 1.1.1.1.8.8
Unit of measure: M2
created: 2021-08-03
modified: 2021-08-03
comment: Smallest cross section area in square metres of the tunnel.
domain: Tunnel
range: integer
term status: stable

Current or power limitation on board required
type: DatatypeProperty
XML name: ERS_PowerLimitOnBoard
RINF index: 1.1.1.2.5.1
used in RCC calculations: true
created: 2020-08-25
modified: 2021-09-12
comment: Indication of whether an on board current or power limitation function on vehicles is required.
domain: Energy Subsystem
range: boolean
term status: stable

Currently valid
type: DatatypeProperty
created: 2022-12-13
comment: TODO review: - not in use. Indicates whether a feature, e.g. operational point, is currently valid according to its validity start and end dates.
domain: ERA Feature
range: boolean
deprecated: true
term status: stable

D_NVOVTRP
type: ObjectProperty
type: FunctionalProperty
type: DatatypeProperty
XML name: CPE_DNVOVTRP
Appendix D3 index: 1.5.5
RINF index: 1.1.1.3.2.16.5
RINF index: 1.2.1.1.1.16.5
Unit of measure: http://qudt.org/vocab/unit/M
created: 2022-11-07
modified: 2024-01-08
modified: 2024-04-18
requires: Only applicable when selected value for 1.1.1.3.2.1 (ETCS present).
source: oj
comment: Maximum distance for overriding the train trip in metres. Precision: [NNNNNN.N] with N a decimal number (0÷9) In Subset 26, chapter 7. 7.5.1.15 D_NVOVTRP.
domain: CCS Subsystem
range: number
term status: stable

D_NVPOTRP
type: ObjectProperty
type: FunctionalProperty
type: DatatypeProperty
XML name: CPE_DNVPOTRP
Appendix D3 index: 1.5.7
RINF index: 1.1.1.3.2.16.7
RINF index: 1.2.1.1.1.16.7
Unit of measure: http://qudt.org/vocab/unit/M
created: 2022-11-07
modified: 2023-03-14
modified: 2024-04-18
requires: Only applicable when selected value for 1.1.1.3.2.1 (ETCS present).
source: oj
comment: Maximum distance for reversing in Post Trip mode in metres. Precision: [NNNNNN.N], with N a decimal number (0÷9) See: TSI CCS (Subset 26, chapter 7. 7.5.1.16 D_NVPOTRP)
domain: CCS Subsystem
range: number
term status: stable

D_NVROLL
type: ObjectProperty
type: FunctionalProperty
type: DatatypeProperty
XML name: CPE_DNVROLL
Appendix D3 index: 1.5.1
RINF index: 1.1.1.3.2.16.1
RINF index: 1.2.1.1.1.16.1
Unit of measure: http://qudt.org/vocab/unit/M
created: 2022-11-07
modified: 2023-03-14
modified: 2024-04-18
requires: Only applicable when selected value for 1.1.1.3.2.1 (ETCS present).
source: oj
comment: Parameter used by the ETCS on-board to supervise the distance allowed to be travelled under the roll-away protection and the reverse movement protection, in metres. Precision: [NNNNNN.N], with N a decimal number (0÷9). See: TSI CCS (Subset 26, chapter 7. 7.5.1.17 D_NVROLL)
domain: CCS Subsystem
range: number
term status: stable

Dangerous goods tank code
type: DatatypeProperty
ERATV index: 4.1.9
created: 2021-08-25
modified: 2021-08-25
comment: Dangerous goods for which the vehicle is suitable (tank code).
domain: Vehicle Type
range: string
term status: stable

Data GSM-R network
type: ObjectProperty
ERATV index: 4.13.2.11
in SKOS Concept Scheme: GSMRNetworks
created: 2020-08-31
modified: 2021-08-02
comment: Data SIM Card GSM-R Home Network.
domain: Vehicle Type
range: Concept
term status: stable

Radio system compatibility data
type: ObjectProperty
XML name: CRG_RadioCompData
ERATV index: 4.13.2.8
in SKOS Concept Scheme: RadioSystemCompatibilitiesData
RINF index: 1.1.1.3.3.10
RINF index: 1.2.1.1.2.10
created: 2020-08-31
modified: 2021-09-12
modified: 2024-04-18
requires: GSM-R (parameter 1.1.1.3.3.1) and ETCS L2 (parameter 1.1.1.3.2.1) must be installed for this parameter to be applicable.
source: esc-rsc technical document en.pdf
comment: Radio requirements used for demonstrating technical compatibility data. Information on RSC data requirements per country: https://www.era.europa.eu/era-folder/radio-system-compatibility-rsc-voice-and-data-documents
domain: Class
  union of: CCS Subsystem
  union of: Vehicle Type
range: Concept
term status: stable

Defines subset
type: ObjectProperty
created: 2022-11-04
modified: 2023-03-14
comment: (deprecated) not in use anymore. For the purposes of the register of infrastructure, each infrastructure manager may describe its railway network optionally via common characteristic subsets.
domain: Infrastructure manager
range: Subset with common characteristics
deprecated: true
term status: stable

EI declaration of demonstration (as defined Recommendation 2014/881/EU) for track relating to compliance with the requirements from TSIs applicable to energy subsystem
type: DatatypeProperty
XML name: EDE_EIDemonstration
RINF index: 1.1.1.2.1.2
created: 2021-08-08
modified: 2024-01-08
comment: Unique number for EI declarations following the same format requirements as specified for EC declarations in Annex VII of Commission Implementing Regulation (EU) 2019/250.
domain: Energy Subsystem
range: string
term status: stable

EI declaration of demonstration (as defined Commission 2014/881/EU) for track relating to compliance with the requirements from TSIs applicable to infrastructure subsystem
type: DatatypeProperty
XML name: IDE_EIDemonstration
RINF index: 1.1.1.1.1.2
RINF index: 1.2.1.0.1.2
RINF index: 1.2.2.0.1.2
created: 2021-08-03
modified: 2024-01-08
comment: Unique number for EI declarations following the same format requirements as specified for EC declarations in Annex VII of Commission Implementing Regulation (EU) 2019/250. In https://eur-lex.europa.eu/legal-content/EN/TXT/HTML/?uri=CELEX:32019R0777&from=EN
domain: Infra Subsystem
range: string
term status: stable

EI declaration of demonstration (as defined in Recommendation 2014/881/EU) relating to compliance with the requirements from TSIs applicable to railway tunnel
type: DatatypeProperty
XML name: ITU_EIDemonstration
RINF index: 1.1.1.1.8.6
RINF index: 1.2.1.0.5.4
RINF index: 1.2.2.0.5.4
created: 2021-08-03
modified: 2024-01-08
comment: Unique number for EI declarations following the same format requirements as specified for EC declarations in Annex VII of Commission Implementing Regulation (EU) 2019/250.
domain: Infra Subsystem
range: string
term status: stable

Design mass under exceptional payload
type: DatatypeProperty
ERATV index: 4.5.2.3
created: 2020-08-24
modified: 2020-11-03
comment: Design mass under exceptional payload.
domain: Vehicle Type
range: integer
term status: stable

Design mass under normal payload
type: DatatypeProperty
ERATV index: 4.5.2.2
created: 2020-08-24
modified: 2020-11-03
comment: Design mass under normal payload.
domain: Vehicle Type
range: integer
term status: stable

Design mass in working order
type: DatatypeProperty
ERATV index: 4.5.2.1
created: 2020-08-24
modified: 2020-11-03
comment: Design mass in working order.
domain: Vehicle Type
range: integer
term status: stable

Diesel or other thermal traction allowed
type: DatatypeProperty
XML name: ITU_DieselThermAllowed
RINF index: 1.2.1.0.5.9
created: 2021-08-09
modified: 2021-08-09
comment: Indication whether it is allowed to use diesel or other thermal traction in the tunnel.
domain: Tunnel
range: boolean
term status: stable

Digital schematic overview
type: DatatypeProperty
RINF index: 1.2.0.0.0.7.2
created: 2023-03-14
comment: TODO review: Diagrammatic representation of the operational point in Well Known Text polyline
domain: Operational Point
range: wktLiteral
term status: stable

direction
type: ObjectProperty
comment: The direction of the orientation of a railway element, in relation to the carrier object
domain: Orientation
range: ConceptScheme
sub property of: topObjectProperty
definition: direction

Distance between signboard and phase separation ending
type: DatatypeProperty
XML name: EOS_DistSignToPhaseEnd
RINF index: 1.1.1.2.4.3
used in RCC calculations: true
created: 2021-08-08
modified: 2021-09-12
comment: Specific for route compatibility check on French network. Distance between the signboard authorizing the driver to ‘raise pantograph’ or ‘close the circuit breaker’ after passing the phase separation and the end of the phase separation section.
domain: Energy Subsystem
range: integer
term status: stable

Document with restriction related to the position of Multiple Traction unit(s) to comply with contact line separation
type: DatatypeProperty
RINF index: 1.1.1.2.5.5
created: 2023-03-14
comment: Name and/or reference of the document specifying the restriction(s) related to the position of Multiple Traction unit(s) to comply with contact line separation.
domain: Energy Subsystem
range: anyURI
term status: stable

Document with restriction related to power consumption of specific electric traction unit(s)
type: DatatypeProperty
RINF index: 1.1.1.2.5.4
created: 2023-03-14
comment: Name and/or reference of the document specifying the restriction(s) related to power consumption of specific electric traction unit(s).
domain: Energy Subsystem
range: anyURI
term status: stable

Document URL
type: DatatypeProperty
created: 2024-04-23
comment: URL that is used to download a document, e.g. url for a reference document in RINF.
domain: ERA Document
range: anyURI
term status: stable

Driving cabs
type: DatatypeProperty
ERATV index: 4.1.1
created: 2021-08-24
modified: 2021-08-24
comment: Number of driving cabs. For wagons the number of driving cabs is to be set to zero (0).
domain: Vehicle Type
range: integer
term status: stable

Eddy current brake prevention
type: DatatypeProperty
ERATV index: 4.7.4.1.2
created: 2020-08-24
modified: 2020-11-03
comment: Possibility of preventing the use of the eddy current track brake (only if fitted with eddy current brake)
domain: Vehicle Type
range: boolean
term status: stable

Use of eddy current brakes
type: ObjectProperty
XML name: ILR_EddyCurrentBrakes
Appendix D2 index: 3.4.5
in SKOS Concept Scheme: EddyCurrentBraking
RINF index: 1.1.1.1.6.2
RINF index: 1.2.1.0.4.2
used in RCC calculations: true
created: 2020-08-24
modified: 2022-09-06
source: oj
comment: Indication of limitations on the use of eddy current brakes.
comment: This property has been modified to be a RINF parameter (its eratvIndex is deleted). It is treated as a SKOS by RINF and as a boolean by ERATV. A new ERATV datatype property has been defined, eddyCurrentBrakingFitted with boolean values.
domain: Infra Subsystem
range: Concept
term status: stable

Document with the conditions for the use of eddy current brakes
type: ObjectProperty
XML name: ILR_ECBDocRef
Appendix D2 index: 3.4.5
RINF index: 1.1.1.1.6.4
used in RCC calculations: true
created: 2020-08-24
modified: 2021-09-10
modified: 2024-04-23
source: oj
comment: Electronic document available in two EU languages from the IM stored by the Agency with conditions for the use of eddy current brakes identified in 1.1.1.1.6.2.
domain: Infra Subsystem
range: ERA Document
term status: stable
change note: Change from datatype property to object property in order to point to the class Document (reference document)

Eddy current braking fitted
type: DatatypeProperty
ERATV index: 4.7.4.1.1
created: 2022-09-06
comment: Eddy current track brake fitted. New property defined to distinghish it from eddyCurrentBraking which is a RINF SKOS property.
domain: Vehicle Type
range: boolean
term status: stable

Element A
type: ObjectProperty
RINF index: 1.1.1.0.1.2
RINF index: 1.2.4.1
created: 2021-04-01
modified: 2023-03-14
comment: References the first topological object in an oriented relation. Indicates the object that corresponds to a section of line, an operational point or a track inside an operational point connected at start.
deprecated: true
term status: stable
alternative label: Internal connection

Element B
type: ObjectProperty
RINF index: 1.1.1.0.1.2
RINF index: 1.2.4.1
created: 2021-04-01
modified: 2023-03-14
comment: References the second topological object in an oriented relation. Indicates the object that corresponds to a section of line, an operational point or a track inside an operational point connected at end.
deprecated: true
term status: stable
alternative label: Internal connection

Element part
type: ObjectProperty
created: 2021-04-01
modified: 2021-04-01
comment: References the topology object of a higher-granularity level which contains a lower-granularity topology object.
deprecated: true
term status: stable

element part of
type: ObjectProperty
comment: References the topology object of a lower-granularity level which is part of a higher-granularity topology object.
domain: Topological Object
range: Topological Object
sub property of: topObjectProperty

Emergency braking
type: DatatypeProperty
ERATV index: 4.7.5
created: 2020-08-24
modified: 2021-08-26
comment: Stopping distance and deceleration profile for each load condition per design maximum speed.
domain: Vehicle Type
range: string
term status: stable

End coupling type
type: ObjectProperty
ERATV index: 4.9.1
in SKOS Concept Scheme: EndCouplingType
created: 2021-08-31
modified: 2021-08-31
comment: Type of end coupling (indicating tensile and compressive forces).
domain: Vehicle Type
range: Concept
term status: stable

End intrinsic coordinate
type: DatatypeProperty
created: 2021-04-01
modified: 2021-04-01
comment: TODO review: Indicates the coordinate point where a linear object ends.
range: double
deprecated: true
term status: stable

End of tunnel location
type: ObjectProperty
XML name: SOLTunnelEnd
RINF index: 1.1.1.1.8.4
created: 2020-07-29
modified: 2024-02-05
comment: Part of the End of tunnel that indicates the Geographical coordinates according to the standard World Geodetic System (WGS). Precision for both geographical latitude and geographical longitude is assumed as [NN.NNNNNNN] in degrees with decimals what gives discretion of 10 m cm in the network. The End of tunnel is the Geographical coordinates in decimal degrees and km of the line at the end of a tunnel.
domain: Tunnel
range: Class
  union of: Geometry
  union of: Point
sub property of: hasGeometry
sub property of: Location
term status: stable

Energy meter installed
type: DatatypeProperty
ERATV index: 4.10.12
created: 2021-08-31
modified: 2021-08-31
comment: TSI conform energy meter for billing purposes installed on board.
domain: Vehicle Type
range: boolean
term status: stable

Energy supply max power
type: DatatypeProperty
ERATV index: 4.10.2
created: 2021-08-31
modified: 2021-08-31
comment: Maximum power (to be indicated for each energy supply system the vehicle is equipped for), given in kW.
domain: Vehicle Type
range: double
term status: stable

energy supply system
type: ObjectProperty
XML name: ECS_VoltFreq
Appendix D2 index: 3.3.1
ERATV index: 4.10.1
in SKOS Concept Scheme: EnergySupplySystems
RINF index: 1.1.1.2.2.1.2
used in RCC calculations: true
created: 2020-08-24
modified: 2024-01-08
source: oj
comment: Indication of the traction supply system (nominal voltage and frequency).
domain: Class
  union of: Contact Line System
  union of: Vehicle Type
range: Concept
term status: stable

Energy supply system TSI compliant
type: DatatypeProperty
XML name: ECS_TSIVoltFreq
RINF index: 1.1.1.2.2.1.2.1
used in RCC calculations: true
created: 2020-08-24
modified: 2021-08-06
comment: Indication if the traction supply system (nominal voltage and frequency) is fully compliant with TSI.
domain: Contact Line System
range: boolean
term status: stable

ERATV index
type: AnnotationProperty
created: 2020-11-03
modified: 2020-11-03
comment: Index code used in the original definition of a parameter in ERATV.
term status: stable

Error corrections required for the on-board ETCS, GSM-R and/or ATO function
type: ObjectProperty
XML name: CDE_ReqErrorCorrections
in SKOS Concept Scheme: OnboardErrorCorrections
RINF index: 1.1.1.3.1.2
RINF index: 1.2.1.1.1.19
created: 2024-04-18
comment: List of unacceptable errors impacting the IM network that are required to be solved in the on-board according to the TSI CCS point 7.2.10.3 specification maintenance point (ETCS, GSM-R and/or ATO). An additional parameter (era:errorCorrectionsOnboardExplanation) must document if a non-implemented CR has been accepted by the IM.
domain: CCS Subsystem
range: Concept
term status: stable

Reasons for Error corrections required, but accepted by the IM for the on-board ETCS, GSM-R and/or ATO function
type: DatatypeProperty
XML name: CDE_ReqErrorCorrections
RINF index: 1.1.1.3.1.2
RINF index: 1.2.1.1.1.19
created: 2024-04-18
comment: Explanation on why a mandatory onboard CR required to be solved in the on-board (ETCS, GSM-R and/or ATO) was accepted by the IM.
domain: CCS Subsystem
range: string
term status: stable

(Deprecated) ERTMS error corrections required for the on-board. Use: errorCorrectionsOnboard
type: DatatypeProperty
created: 2024-01-08
modified: 2024-04-18
comment: List of unacceptable errors impacting the IM network that are required to be solved in the on-board according to the TSI CCS (point 7.2.10.3 - specification maintenance point).
domain: CCS Subsystem
range: anyURI
deprecated: true
term status: stable

ETCS baseline
type: ObjectProperty
XML name: CPE_Baseline
Appendix D2 index: 3.2.7
ERATV index: 4.13.1.2
in SKOS Concept Scheme: ETCSBaselines
RINF index: 1.1.1.3.2.2
RINF index: 1.2.1.1.1.2
created: 2021-08-07
description: The ETCS baseline needs to be provided for each available ETCS Level. See: TSI CCS (Table A2)
modified: 2021-08-31
modified: 2024-04-18
requires: Only applicable when selected value for 1.1.1.3.2.1 (ETCS present).
source: oj
comment: ETCS baseline installed lineside
domain: Class
  union of: ETCS
  union of: Vehicle Type
range: Concept
term status: stable

ETCS data communication application
type: DatatypeProperty
ERATV index: 4.13.2.9
created: 2021-08-31
modified: 2021-08-31
comment: Data communication application for ETCS implementation.
domain: Vehicle Type
range: string
term status: stable

ETCS level for degraded situation
type: ObjectProperty
XML name: CLD_ETCSSituation
Appendix D2 index: 3.4.1
in SKOS Concept Scheme: ETCSSituations
RINF index: 1.1.1.3.10.1
RINF index: 1.2.1.1.9.1
created: 2021-08-09
description: System for degraded situation. In case of failure of the ETCS Level for normal operation, train movement can be supervised in another ETCS Level. Example: Level 1 as a degraded mode for Level 2. If parameter 1.1.1.3.2.1 is not used (no ETCS), no degradation is possible, so only ‘none’ level is possible for degraded case. See also TSI OPE 4.2.3.6. Degraded operation.
modified: 2021-09-12
modified: 2024-04-18
requires: Only applicable when selected value for 1.1.1.3.2.1 (ETCS present). Degraded level must be lower than actual operating level.
source: http://data.europa.eu/eli/reg_impl/2019/773/2023-09-28
source: oj
comment: ERTMS / ETCS application level for degraded situation related to the track side equipment.
domain: CCS Subsystem
range: Concept
term status: stable

ETCS equipment level
type: ObjectProperty
ERATV index: 4.13.1.1
in SKOS Concept Scheme: ETCSEquipmentLevels
created: 2021-08-31
modified: 2021-08-31
comment: ETCS equipment on-board and its level.
domain: Vehicle Type
range: Concept
term status: stable

(Deprecated) ETCS error corrections required for the on-board. Use: errorCorrectionsOnboard
type: DatatypeProperty
RINF index: 1.2.1.1.1.19
created: 2023-03-14
modified: 2024-01-08
modified: 2024-04-18
comment: List of unacceptable errors impacting the IM network that are required to be solved in the on-board ETCS according to the CCS TSI point 7.2.10.3 specification maintenance point.
domain: CCS Subsystem
range: anyURI
deprecated: true
term status: stable

ETCS trackside implements level crossing procedure or an equivalent solution
type: DatatypeProperty
type: FunctionalProperty
XML name: CPE_LXProcedure
Appendix D3 index: 1.2
RINF index: 1.1.1.3.2.13
RINF index: 1.2.1.1.1.13
created: 2022-11-04
modified: 2024-04-18
requires: Only applicable when selected value for 1.1.1.3.2.1 (ETCS present).
source: oj
comment: If the trackside does not implement any solution to cover defective LXs (which are normally protected by means of a technical system), then drivers will be required to comply with instructions received from other sources.
domain: CCS Subsystem
range: boolean
term status: stable

ETCS infill installed line-side
type: ObjectProperty
type: FunctionalProperty
XML name: CPE_InfillLineSide
ERATV index: 4.13.1.3
in SKOS Concept Scheme: ETCSInfills
RINF index: 1.1.1.3.2.4
RINF index: 1.2.1.1.1.4
created: 2021-08-08
description: TSI CCS (4.2.2 & 4.3.3)
modified: 2021-09-12
modified: 2024-04-18
source: oj
comment: Information about installed trackside equipment capable of transmitting infill information by loop or Global System for Mobile communications for Railways (GSM-R) for level 1 installations.
domain: Class
  union of: CCS Subsystem
  union of: Vehicle Type
range: Concept
term status: stable

ETCS infill necessary for line access
type: DatatypeProperty
type: FunctionalProperty
XML name: CPE_Infill
RINF index: 1.1.1.3.2.3
RINF index: 1.2.1.1.1.3
created: 2021-08-08
description: As indicated in CCS TSI section 7.2.9.1, an ETCS Level 1 trackside application may require that the on-board is equipped with the corresponding in-fill data transmission (Euroloop or radio) if the release speed is set to zero for safety reasons. See: TSI CCS 7.2.9.1 & 4.2.3
modified: 2021-09-12
requires: Only applicable when selected value for 1.1.1.3.2.1 (ETCS present).
source: oj
comment: Indication whether infill is required to access the line for safety reasons.
domain: CCS Subsystem
range: boolean
term status: stable

ETCS
type: ObjectProperty
RINF index: 1.2.1.1.1.1
created: 2021-08-07
modified: 2021-09-12
comment: European Train Control System (ETCS) application level related to the track side equipment.
domain: CCS Subsystem
range: ETCS
term status: stable

ETCS level
type: ObjectProperty
XML name: CPE_Level
Appendix D2 index: 3.2.7
in SKOS Concept Scheme: ETCSLevels
RINF index: 1.1.1.3.2.1
RINF index: 1.2.1.1.1.1
created: 2021-08-07
description: The different ERTMS / ETCS application levels are a way to express the possible operating relationships between track and train. Level definitions are principally related to the track side equipment used, to the way the track side information reaches the on-board units and to which functions are processed in the track side and in the on-board equipment respectively.
modified: 2024-01-08
modified: 2024-04-18
relation: cant deficiency used for the basic SSP
relation: ETCS baseline
relation: ETCS level for degraded situation
relation: ETCS M_version
relation: ETCS system compatibility
relation: Track conditions which can be transmitted
relation: Number of active GSM-R mobiles (EDOR) or simultaneous communication session on-board for ETCS Level 2 needed to perform radio block centre handovers without having an operational disruption
relation: ERTMS/ETCS Radio Block Center (RBC) identifier
relation: ERTMS/ETCS Radio Block Center (RBC) phone number
requires: If ETCS is on the trackside (one or more levels are selected), all other ETCS parameters (from 1.1.1.3.2.2 to 1.1.1.3.2.10) are applicable. The ETCS value NTC is only relevant when the line is dual equipped with ETCS (i.e., balises are placed in the track) and Class B system, and both systems are in operation at the same time. In those cases, this parameter should be filled relevant ETCS Level and repeated with the value “NTC”. If the line is only equipped with Class B, this should be reflected in Parameter 1.1.1.3.5.3, and this parameter etcsLevelType should not be used. See: TSI CCS (Subset-026, Chapter 2, 2.6)
source: oj
comment: European Train Control System (ETCS) application level related to the track side equipment.
domain: ETCS
range: Concept
term status: stable

ETCS M_version
type: ObjectProperty
type: FunctionalProperty
XML name: CPE_MVersion
in SKOS Concept Scheme: ETCSMVersions
RINF index: 1.1.1.3.2.10
RINF index: 1.2.1.1.1.10
used in RCC calculations: true
created: 2021-08-08
modified: 2021-09-12
modified: 2024-04-18
requires: Only applicable when selected value for 1.1.1.3.2.1 (ETCS present).
source: oj
comment: ETCS M_version according to SRS 7.5.1.9.
domain: CCS Subsystem
range: Concept
term status: stable

ETCS national applications
type: DatatypeProperty
ERATV index: 4.13.1.4
created: 2021-08-31
modified: 2021-08-31
comment: ETCS national applications implemented (NID_XUSER of Packet 44).
domain: Vehicle Type
range: string
term status: stable

ETCS national packet 44 application implemented
type: DatatypeProperty
XML name: CPE_NatApplication
RINF index: 1.1.1.3.2.5
RINF index: 1.2.1.1.1.5
created: 2021-08-08
description: Value can be `false` or a link to the implemented functions. Packets 44 are the means to transmit data for national applications between train and track and vice versa, using the data transmission facilities included within the ETCS. NID_XUSER values managed by ERA in a document about ETCS variables available on ERA website. See: TSI CCS (7.4.3 & 6.2.4.2)
modified: 2021-09-12
modified: 2024-04-18
requires: Only applicable when selected value for 1.1.1.3.2.1 (ETCS present).
source: oj
comment: Indication whether data for national packet 44 applications is transmitted between track and train.
domain: CCS Subsystem
range: Datatype
  union of: boolean
  union of: string
term status: stable

ETCS on-board implementation
type: DatatypeProperty
ERATV index: 4.13.1.7
created: 2021-08-31
modified: 2021-08-31
comment: ETCS on-board implementation.
domain: Vehicle Type
range: string
term status: stable

ETCS optional functions
type: DatatypeProperty
RINF index: 1.1.1.3.2.7
created: 2021-08-08
modified: 2023-03-14
source: oj
comment: Deprecated according to the ammendment to the Regulation (EU) 2019/777. Optional ETCS functions which might improve operation on the line.
domain: CCS Subsystem
range: string
deprecated: true
term status: unstable

ETCS system compatibility
type: ObjectProperty
XML name: CPE_SystemCompatibility
ERATV index: 4.13.1.8
in SKOS Concept Scheme: ETCSSystemCompatibilities
RINF index: 1.1.1.3.2.9
RINF index: 1.2.1.1.1.9
used in RCC calculations: true
created: 2020-08-31
definition: The Values "Not defined" or "ESC-EU-0" should not be combined with other values. For application in CCS Onboard: The vehicles are considered compatible with the infrastructure for this parameter, if their parameter value matches any of the values declared on the trackside. For application in CCS Trackside: The Infrastructure Manager is responsible for defining the ESC type(s). All sections of the Union network which require the same set of checks for the demonstration of ESC shall have the same ESC type. See: TSI CCS, Appendix A, Table A 1, 4.2.17 a. The list of ESC Types is published and maintained by the European Union Agency for Railways in the technical document ‘ESC/RSC technical document, TD/011REC1028’. The Agency shall assess the checks unless they have been assessed by a NoBo as required in Table 6.3 row 10. The assessment by the Agency shall be done within 2 months of receipt thereof, unless a longer period is agreed between the Agency and the Infrastructure Manager but not exceeding 4 months in total. The technical document will be updated within 10 working days after positive assessment. The ESC Types shall only be used when published with status ‘Valid’ in the Agency Technical document referred above.
modified: 2021-09-12
requires: Only applicable when selected value for 1.1.1.3.2.1 (ETCS present).
source: oj
source: esc-rsc technical document en.pdf
comment: ETCS requirements used for demonstrating technical compatibility.
domain: Class
  union of: CCS Subsystem
  union of: Vehicle Type
range: Concept
term status: stable

ETCS system version 2.2 or 3.0 functionalities to be required in the next 5 years. Deprecated with TWG RINF CCS 2024.
type: DatatypeProperty
RINF index: 1.1.1.3.2.19
RINF index: 1.2.1.1.1.20
created: 2023-03-14
modified: 2024-01-08
modified: 2024-04-18
comment: (Deprecated) List of ETCS system version 2.2 or 3.0 functionalities to be required in the next 5 years according to TSI CCS (6.1.1.2) and Appendix G.
domain: CCS Subsystem
range: anyURI
sub property of: topDataProperty
deprecated: true
term status: stable

Is the ETCS trackside engineered to transmit Track Conditions
type: DatatypeProperty
type: FunctionalProperty
XML name: CPE_CanTransmitTCs
Appendix D3 index: 1.1
RINF index: 1.1.1.3.2.12
RINF index: 1.2.1.1.1.12
created: 2022-11-04
modified: 2023-03-14
modified: 2024-04-18
requires: Only applicable when selected value for 1.1.1.3.2.1 (ETCS present).
source: oj
comment: If the trackside does not provide Track Conditions, the driver will need to be informed about such conditions via alternative methods.
domain: CCS Subsystem
range: boolean
term status: stable

Track conditions which can be transmitted
type: ObjectProperty
type: FunctionalProperty
XML name: CPE_TransmittedTCs
Appendix D3 index: 1.1
in SKOS Concept Scheme: TransmittedTrackConditions
RINF index: 1.1.1.3.2.12.1
RINF index: 1.2.1.1.1.12.1
created: 2022-11-16
modified: 2023-03-14
modified: 2023-04-18
requires: Only applicable when selected value for 1.1.1.3.2.1 (ETCS present).
source: oj
comment: Transmittable track conditions by the CCSSubsystem, as per CCS TSI. See: TSI CCS (Subset-026, Chapter 5, section 5.18.1.1)
domain: CCS Subsystem
range: Concept
term status: unstable

Ferromagnetic wheel material
type: DatatypeProperty
ERATV index: 4.14.2.12
created: 2021-09-01
modified: 2021-09-01
comment: Wheel material is ferromagnetic.
domain: Vehicle Type
range: boolean
term status: stable

Fire safety category
type: ObjectProperty
ERATV index: 4.4.1
in SKOS Concept Scheme: Categories
created: 2020-08-29
modified: 2021-08-03
comment: Fire safety category for tunnels.
domain: Vehicle Type
range: Concept
term status: stable

Fixed seats
type: DatatypeProperty
ERATV index: 4.12.1.1
created: 2021-08-31
modified: 2021-08-31
comment: Number of fixed seats.
domain: Vehicle Type
range: string
term status: stable

Use of flange lubrication forbidden
type: DatatypeProperty
XML name: IHS_FlangeLubeForbidden
RINF index: 1.1.1.1.7.1
created: 2021-08-08
modified: 2021-09-11
comment: Indication whether the use of on-board device for flange lubrication is forbidden.
domain: Infra Subsystem
range: boolean
term status: stable

Existence of rules on on-board flange lubrication
type: DatatypeProperty
XML name: CTD_FlangeLubeRules
RINF index: 1.1.1.3.7.20
created: 2021-08-08
modified: 2023-03-14
comment: Deprecated according to the ammendment to the Regulation (EU) 2019/777. Indication whether rules for activation or deactivation of flange lubrication exist.
domain: Train Detection System
range: boolean
deprecated: true
term status: stable

Flange lubrication fitted
type: DatatypeProperty
ERATV index: 4.9.3.1
created: 2021-08-31
modified: 2021-08-31
comment: Indicates if the vehicle type is fitted for flange lubrication.
domain: Vehicle Type
range: boolean
term status: stable

Part of a Railway Freight Corridor
type: ObjectProperty
XML name: IPP_FreightCorridor
in SKOS Concept Scheme: FreightCorridors
RINF index: 1.1.1.1.2.3
RINF index: 1.2.1.0.2.3
created: 2021-08-03
modified: 2024-01-08
comment: Indication whether the line is designated to a Railway Freight Corridor.
domain: Infra Subsystem
range: Concept
term status: stable

freight flag
type: DatatypeProperty
created: 2024-06-03
domain: Primary Location
range: boolean

Section with train detection limitation, only for the French network
type: ObjectProperty
XML name: CTD_TCLimitation
in SKOS Concept Scheme: FrenchTrainDetectionSystemLimitations
RINF index: 1.1.1.3.7.1.4
RINF index: 1.2.1.1.6.3
created: 2020-08-24
is replaced by: Section with train detection limitation
is replaced by: Section with train detection limitation number, only for French network
is replaced by: Section with train detection limitation, only for the French network
modified: 2022-04-05
comment: Specific for route compatibility check on French network.The reason for deprecation is because of replacement by a class, an object property and two datatype properties. The reason is that the property is composed of two values: A boolean [Y/N] and a number N is between 1 and 8.
domain: Train Detection System
range: Concept
deprecated: true
term status: stable

Section with train detection limitation
type: DatatypeProperty
XML name: CTD_TCLimitation
RINF index: 1.2.1.1.6.3
RINF index: 1.1.1.3.7.1.4
used in RCC calculations: true
created: 2023-04-05
relation: Section with train detection limitation, only for the French network
comment: Part of the section with train detection limitation that indicates if it is applicable. Only for the French network.
domain: Section with train detection limitation
range: boolean
term status: stable

Section with train detection limitation number, only for French network
type: ObjectProperty
XML name: CTD_TCLimitation
in SKOS Concept Scheme: FrenchTrainDetectionSystemLimitationNumbers
RINF index: 1.1.1.3.7.1.4
RINF index: 1.2.1.1.6.3
used in RCC calculations: true
created: 2023-04-05
modified: 2024-04-18
comment: Part of the section with train detection limitation that indicates the type of train detection limitation. Specific for route compatibility check on French network. Sections with: [1] Tonnage circulated per track is inferior to 15000 tons/day/track [2] Directional Interlocking [3] 45-second delay for directional interlocking [4] Installation with track circuit announcement [5] Absence of a shunting assistance pedal in the normal direction of circulation for non-reversible double track lines [6] Absence of a shunting assistance pedal regardless of the direction of traffic for single track lines and tracks for two way working [7] Absence of a pedal announcement mechanism [8] 45-second delay for specific announcement reset devices
domain: Section with train detection limitation
range: Concept
term status: stable

frequency bands for detection
type: ObjectProperty
XML name: CCD_TSIFreqBandsDet
in SKOS Concept Scheme: FrequencyBandsForDetection
RINF index: 1.1.1.3.4.2
RINF index: 1.2.1.1.3.2
created: 2023-03-14
description: Verification of compliance with TSI includes application of notified national rules (when they exist). Multiple selection from a predefined list: - Axle Counters: bands A1-A3 - Track circuits: bands A1-A8
modified: 2024-04-18
relation: maximum interference current
relation: Vehicle impedance
relation: Maximum magnetic field
source: index077 - ERA ERTMS 033281 v5.pdf
comment: Bands of the frequency management of the train detection systems as defined in the TSI CCS (Annex I, Appendix A, Table A.2 -Index 77), and in the specific cases or technical documents referred to in Article 13 of TSI CCS when they are available.
domain: Train Detection System
range: Concept
term status: unstable

from
type: ObjectProperty
domain: Linear Element Link
range: Linear Element

Railway location of particular points requiring specific checks
type: DatatypeProperty
XML name: ILL_GaugeCheckLoc
RINF index: 1.1.1.1.3.1.2
RINF index: 1.2.1.0.3.5
used in RCC calculations: true
created: 2020-07-29
modified: 2024-01-08
comment: Location of particular points requiring specific checks due to deviations from gauging referred to in parameter "Gauging".
domain: Infra Subsystem
range: string
term status: stable

gauging
type: ObjectProperty
XML name: ILL_Gauging
ERATV index: 4.2.1
in SKOS Concept Scheme: GaugingProfiles
RINF index: 1.1.1.1.3.1.1
RINF index: 1.2.1.0.3.4
used in RCC calculations: true
created: 2020-07-29
modified: 2023-03-14
comment: Gauges as defined in European standard or other local gauges, including lower or upper part. In accordance with point 7.3.2.2 of LOC&PAS TSI, sections of lines of the United Kingdom of Great Britain network may not have gauge reference profile.
domain: Class
  union of: Infra Subsystem
  union of: Vehicle Type
range: Concept
term status: stable

Document with the transversal section of the particular points requiring specific checks
type: ObjectProperty
XML name: ILL_GaugeCheckDocRef
RINF index: 1.1.1.1.3.1.3
RINF index: 1.2.1.0.3.6
used in RCC calculations: true
created: 2020-08-24
modified: 2024-04-23
comment: Electronic document available from the IM stored by the Agency with the transversal section of the particular points requiring specific checks due to deviations from gauging referred to in parameter "Gauging". Where relevant, guidance for the check with the particular point may be attached to the document with the transversal section.
domain: Infra Subsystem
range: ERA Document
term status: stable
change note: Change from datatype property to object property in order to point to the class Document (reference document)

GPRS for ETCS
type: DatatypeProperty
type: FunctionalProperty
XML name: CRG_GPRSForETCS
RINF index: 1.1.1.3.3.3.2
RINF index: 1.2.1.1.2.3.2
created: 2021-08-08
description: Sections of EIRENE and ETCS subsets for trackside in TSI
modified: 2021-09-12
modified: 2024-04-18
relation: ETCS level
requires: GSM-R (parameter 1.1.1.3.3.1) and ETCS L2 (parameter 1.1.1.3.2.1) must be installed for this parameter to be applicable.
source: oj
comment: Indication if GPRS can be used for ETCS.
domain: CCS Subsystem
range: boolean
term status: stable

Area of implementation of GPRS
type: DatatypeProperty
XML name: CRG_GPRSAreaOfImpl
RINF index: 1.1.1.3.3.3.3
RINF index: 1.2.1.1.2.3.3
created: 2021-08-09
modified: 2021-09-12
modified: 2024-04-18
relation: ETCS level
relation: GPRS for ETCS
requires: GSM-R (parameter 1.1.1.3.3.1), ETCS L2 (parameter 1.1.1.3.2.1) and GPRS for ETCS (parameter 1.1.1.3.3.3.2) must be installed for this parameter to be applicable.
comment: Indication of the area in which GPRS can be used for ETCS, expressed as a list of GPRS-enabled RBC's.
domain: CCS Subsystem
range: string
term status: stable

Gradient for stabling tracks
type: DatatypeProperty
XML name: ILL_Gradient
RINF index: 1.2.2.0.3.1
Unit of measure: MilliM-PER-M
used in RCC calculations: true
created: 2021-08-10
modified: 2021-08-10
comment: Maximum value of the gradient for stabling tracks expressed in millimetres per metre.
domain: Infra Subsystem
range: double
term status: stable

Gradient profile
type: DatatypeProperty
XML name: ILL_GradProfile
Appendix D2 index: 3.2.1
Appendix D2 index: 3.2.2
RINF index: 1.1.1.1.3.6
used in RCC calculations: true
created: 2020-08-24
modified: 2021-09-10
comment: Sequence of gradient values and locations of change in gradient.
domain: Infra Subsystem
range: string
term status: stable

Number of active GSM-R mobiles (EDOR) or simultaneous communication session on-board for ETCS Level 2 needed to perform radio block centre handovers without having an operational disruption
type: ObjectProperty
type: FunctionalProperty
XML name: CRG_NumActiveMob
in SKOS Concept Scheme: NumberActiveMobiles
RINF index: 1.1.1.3.3.2
RINF index: 1.2.1.1.2.2
created: 2021-08-08
description: In case there is no ETCS Level 2 in the line, do not use this property. In case there is ETCS Level 2 in the line, the minimum number of EDOR required on board would be 1. In case ETCS baseline 3 release 2 or baseline 4 is selected, select “2”. Please select ”1” or “2”, taking into account that TSI compliant trains may only be fitted with 1 EDOR.
modified: 2021-09-12
relation: ETCS level
requires: GSM-R (parameter 1.1.1.3.3.1) and ETCS L2 (parameter 1.1.1.3.2.1) must be installed for this parameter to be applicable.
comment: Number of simultaneous communication session on board for ETCS level 2 required for a smooth running of the train. This relates to the radio block centre (RBC) handling of communication sessions. Not safety critical and no matter of interoperability.
domain: CCS Subsystem
range: Concept
term status: stable

Additional information on network characteristics
type: ObjectProperty
XML name: CRG_AdditionalnetworkInfo
RINF index: 1.1.1.3.3.3.1
RINF index: 1.2.1.1.2.3.1
created: 2021-08-08
description: Please use this field to indicate any additional information on the GSM-R network. The document(s) itself has(have) to be upload by the NRE via the “reference document management” functionality. The reference of the document(s) is(are) provided as (a) link(s).
modified: 2021-09-12
modified: 2024-04-18
requires: GSM-R (parameter 1.1.1.3.3.1) must be installed for this parameter to be applicable
comment: Any additional information on network characteristics or corresponding document available from the IM and stored by the Agency, e.g.; interference level, leading to the recommendation of additional on-board protection.
domain: CCS Subsystem
range: ERA Document
term status: stable
change note: Change from datatype property to object property in order to point to the class Document (reference document)

No GSMR coverage
type: DatatypeProperty
type: FunctionalProperty
XML name: CRG_GSMRNoCoverage
RINF index: 1.1.1.3.3.8
RINF index: 1.2.1.1.2.8
created: 2021-08-09
description: If GSM-R is not installed, this parameter should not be used. This parameter is mainly to capture the case of Radio Hole functionality (lack of GSM-R coverage), that is foreseen in the ETCS specifications as packet 68. Another possible use is the declaration of a temporary situation where, although the area is in principle covered by GSM-R, there is a long-term outage or a project for replacement of the radio (i.e. a section that will not be covered with GSM-R for half a year or longer).
modified: 2021-09-12
requires: GSM-R (parameter 1.1.1.3.3.1) must be installed for this parameter to be applicable.
comment: Indication if there is no GSMR coverage.
domain: CCS Subsystem
range: boolean
term status: stable

Optional GSM-R functions
type: ObjectProperty
XML name: CRG_OptionalFunctions
in SKOS Concept Scheme: OptionalFunctions
RINF index: 1.1.1.3.3.3
RINF index: 1.2.1.1.2.3
created: 2021-08-08
description: (*1) These inputs refer to the expected behaviour by the network, i.e. if there is any area or point where an automatic selection of network should be done or if there is any location where balises to instruct a change of radio network have been installed. In order to be able to attend to these indications (automatic network, network change by balise) some configuration is needed in the mobile. In case there is a balise used to announce the change of the network, or if there are locations where the network selection is planned by the IM to be done automatically (and not manually, as stated in the requirements). It should be considered as an item that is related to the design of the infrastructure. (*2) the possibility to dial 112 is something specific to the network that should be communicated to the vehicles accessing it. (*3) the use of broadcast calls is something specific to the network that has to be configured in it. (*4) it is something specific to the network that has to be configured in it if the service is provided. (*5) it is something specific to the network that has to be configured in it if the service is provided; something may need to be configured on the network but also in the mobile subscriber data if it wants to use the service. What is requested here is the information of the network capability. (*6) if they are configured on the network. Please indicate which in the “Other information” box. (*7) To be selected if other data applications, different from ETCS L2, can be used within the network – (*8) if it is configured on the network. “GSM-R Shunting used” in order to make public if the GSM-R is used in the network for shunting activities. (*9) Please specify in the “Other information“ box for which services /applications are they planned and which are the frequencies in use. (*11) Please use this field to indicate any additional information on network characteristics, e.g.; interference level, leading to the need of additional on-board protecti…
modified: 2021-09-12
modified: 2024-04-18
requires: GSM-R (parameter 1.1.1.3.3.1) must be installed for this parameter to be applicable
comment: Use of optional GSM-R functions which might improve operation on the line. They are for information only and not for network access criteria.
domain: CCS Subsystem
range: Concept
term status: stable

GSM-R radio data communication
type: ObjectProperty
ERATV index: 4.13.2.7
in SKOS Concept Scheme: GSMRRadioDataCommunications
created: 2021-08-31
modified: 2021-08-31
comment: GSM-R Radio Data communication on board and its Baseline.
domain: Vehicle Type
range: Concept
term status: stable

GSM-R sets in driving cab
type: DatatypeProperty
ERATV index: 4.13.2.2
created: 2021-08-31
modified: 2021-08-31
comment: Number of GSM-R mobile sets in driving cab for data transmission.
domain: Vehicle Type
range: integer
term status: stable

GSM-R version
type: ObjectProperty
XML name: CRG_Version
Appendix D2 index: 3.1.7
Appendix D2 index: 3.4.4
ERATV index: 4.13.2.1
in SKOS Concept Scheme: GSMRVersions
RINF index: 1.1.1.3.3.1
RINF index: 1.2.1.1.2.1
created: 2021-08-08
modified: 2021-09-12
modified: 2024-04-18
requires: GSM-R must be installed for this parameter to be applicable. If this property is not used, all GSM-R related properties should not be used either.
source: oj
comment: GSM-R functional requirements specification and system requirements specification in accordance with the specification respectively referenced in TSI CCS (Annex ), version number installed lineside. Since more than one version may be installed in different areas, this property can have multiple values.
domain: Class
  union of: CCS Subsystem
  union of: Vehicle Type
range: Concept
term status: stable

Specific constraints imposed by the GSM-R network operator on ETCS on-board units only able to operate in circuit-switch
type: ObjectProperty
XML name: CRG_ConstraintsCS
Appendix D3 index: 2.2
in SKOS Concept Scheme: GSMRConstraints
RINF index: 1.1.1.3.3.12
RINF index: 1.2.1.1.2.12
created: 2023-03-14
modified: 2024-04-18
requires: GSM-R (parameter 1.1.1.3.3.1) and ETCS L2 (parameter 1.1.1.3.2.1) must be installed for this parameter to be applicable. Multiple values are allowed.
comment: These constraints, where applicable, are meant to manage the limited number of circuit-switched radio connections that can be handled simultaneously by a Radio Block Center.
domain: CCS Subsystem
range: Concept
term status: stable

(Deprecated) GSM-R error corrections required for the on-board
type: DatatypeProperty
created: 2023-03-14
modified: 2024-01-08
modified: 2024-04-18
comment: List of unacceptable errors impacting the IM network that are required to be solved in the on-board according to the CCS TSI point 7.2.10.3 specification maintenance point. The reason for deprecation is that this parameter does not appear in the latest legal text.
domain: CCS Subsystem
range: anyURI
deprecated: true
term status: stable

Is the GSM-R network configured to allow forced de-registration of a functional number by another driver?
type: DatatypeProperty
type: FunctionalProperty
XML name: CRG_ForcedDeReg
Appendix D3 index: 2.1
RINF index: 1.1.1.3.3.11
RINF index: 1.2.1.1.2.11
created: 2022-11-07
modified: 2023-03-14
modified: 2024-04-18
requires: GSM-R (parameter 1.1.1.3.3.1) and ETCS L2 (parameter 1.1.1.3.2.1) must be installed for this parameter to be applicable.
comment: This feature will determine the applicable operational rules for drivers and signallers when dealing with cab radios registered under wrong numbers.
domain: CCS Subsystem
range: boolean
term status: stable

GSM-R networks covered by a roaming agreement
type: ObjectProperty
XML name: CRG_RoamingAgreement
in SKOS Concept Scheme: GSMRNetworks
RINF index: 1.1.1.3.3.5
RINF index: 1.2.1.1.2.5
used in RCC calculations: true
created: 2020-08-31
description: Name of the own GSM-R network and list of GSM-R networks which are covered by a roaming agreement for CS services. This list is managed by UIC. The Agency will monitor it in order to update the list of possible values when necessary. For Route Compatibility purposes and simplicity, the own network needs to be declared by the IM, so the RUs can systematically check the compatibility. For voice services, roaming for CS is applicable. For ETCS, as long as roaming for CS is ensured, the interoperability will be guaranteed.
modified: 2021-09-12
requires: GSM-R (parameter 1.1.1.3.3.1) must be installed for this parameter to be applicable.
comment: List of GSM-R networks which are covered by a roaming agreement.
domain: CCS Subsystem
range: Concept
term status: stable

handover point flag
type: DatatypeProperty
created: 2024-06-03
domain: Primary Location
range: boolean

Has abstraction
type: ObjectProperty
created: 2020-07-29
is replaced by: has topology
modified: 2022-10-27
comment: Property that links a physical entity with its topological abstraction representation.
domain: Infrastructure object
deprecated: true
term status: stable

Availability by the IM of additional information
type: DatatypeProperty
XML name: CBP_AddInfoAvailable
RINF index: 1.1.1.3.11.2
used in RCC calculations: true
created: 2020-08-24
modified: 2024-01-08
comment: Availability by the IM of additional information as defined in point (2) of point 4.2.2.6.2 of TSI OPE.
domain: CCS Subsystem
range: boolean
term status: stable

Has automatic dropping device
type: DatatypeProperty
ERATV index: 4.10.11
created: 2020-08-25
modified: 2020-11-03
comment: Automatic dropping device (ADD) fitted (to be indicated for each energy supply system the vehicle is equipped for).
domain: Vehicle Type
range: boolean
term status: stable

Existence of ballast
type: DatatypeProperty
XML name: ITP_Ballast
RINF index: 1.1.1.1.4.4
created: 2021-08-03
modified: 2021-09-10
comment: Specifies whether track construction is with sleepers embedded in ballast or not.
domain: Infra Subsystem
range: boolean
term status: stable

Has cant defficiency compensation
type: DatatypeProperty
ERATV index: 4.6.2
created: 2021-08-26
modified: 2021-08-26
comment: Vehicle equipped with a cant deficiency compensation system (tilting vehicle).
domain: Vehicle Type
range: boolean
term status: stable

Has current limitation
type: DatatypeProperty
ERATV index: 4.10.14
created: 2020-08-24
modified: 2020-11-03
comment: Electric units equipped with power or current limitation function.
domain: Vehicle Type
range: boolean
term status: stable

Existence of operating restrictions or conditions
type: DatatypeProperty
XML name: CPE_RestrictionsConditions
RINF index: 1.1.1.3.2.6
RINF index: 1.2.1.1.1.6
created: 2021-08-08
description: If not `false`, a link to the conditions must be provided. The RU has to contact the IM to be informed about these conditions. These conditions and restrictions of use are considered in section 6.4 of the CCS TSI. They should be described using the template available on Agency website (Certification and deviations – Guidelines for using the ERA template) with the following link.
modified: 2024-01-08
modified: 2024-04-18
requires: Only applicable when selected value for 1.1.1.3.2.1 (ETCS present).
source: certification-issues
comment: Indication whether restrictions or conditions due to partial compliance with the TSI CCS exist.
domain: CCS Subsystem
range: Datatype
  union of: anyURI
  union of: boolean
term status: stable

Existence of electric shore supply
type: DatatypeProperty
XML name: ITS_ElectricShoreSupply
RINF index: 1.2.2.0.4.6
created: 2021-08-10
modified: 2021-08-10
comment: Indication whether an installation for electric shore supply exists (fixed installation for servicing trains).
domain: Siding
range: boolean
term status: stable

Existence of emergency plan
type: DatatypeProperty
XML name: ITU_EmergencyPlan
RINF index: 1.1.1.1.8.9
RINF index: 1.2.1.0.5.6
RINF index: 1.2.2.0.5.6
created: 2021-08-03
modified: 2021-08-10
comment: Indication whether emergency plan exists.
domain: Tunnel
range: boolean
term status: stable

Existence of evacuation and rescue points
type: DatatypeProperty
Appendix D2 index: 3.2.3
RINF index: 1.1.1.1.8.13
RINF index: 1.2.1.0.5.11
RINF index: 1.2.2.0.5.10
created: 2022-10-27
modified: 2023-03-14
source: oj
comment: Indication of existence of evacuation and rescue points.
domain: Tunnel
range: boolean
term status: stable

Existence of external cleaning facilities
type: DatatypeProperty
XML name: ITS_ExternalCleaning
RINF index: 1.2.2.0.4.2
created: 2021-08-10
modified: 2024-01-08
comment: Indication whether exists an installation for external cleaning facility (fixed installation for servicing trains) as defined in TSI INF.
domain: Siding
range: boolean
term status: stable

Existence of trackside hot axle box detector (HABD)
type: DatatypeProperty
XML name: IHS_HABDExist
RINF index: 1.1.1.1.7.4
used in RCC calculations: true
created: 2020-08-24
modified: 2024-01-08
comment: Existence of trackside HABD.
domain: Infra Subsystem
range: boolean
term status: stable

Has implementation
type: ObjectProperty
created: 2020-07-29
is replaced by: topology Of
modified: 2022-10-27
comment: Property that links a topological abstraction entity with its physical representation.
range: Infrastructure object
deprecated: true
term status: stable

Existence of level crossings
type: DatatypeProperty
XML name: IHS_LevelCrossing
RINF index: 1.1.1.1.7.2
created: 2021-08-03
modified: 2021-09-11
comment: Indication whether level crossings (including pedestrian track crossing) exist on the section of line.
domain: Infra Subsystem
range: boolean
term status: stable

Has lubrication device prevention
type: DatatypeProperty
ERATV index: 4.9.3.2
created: 2021-08-31
modified: 2021-08-31
comment: Possibility of preventing the use of the lubrication device (only if fitted with flange lubrication).
domain: Vehicle Type
range: boolean
term status: stable

has organisation role
type: ObjectProperty
created: 2024-06-03
comment: The role of the body
domain: Organisation Role
range: Concept

Existence of other train protection, control and warning systems installed
type: DatatypeProperty
RINF index: 1.1.1.3.5.1
created: 2021-08-09
modified: 2023-03-14
comment: Deprecated according to the ammendment to the Regulation (EU) 2019/777. Indication if other train protection, control and warning systems in normal operation are installed lineside.
domain: CCS Subsystem
range: boolean
deprecated: true
term status: unstable

Has parking brake
type: DatatypeProperty
ERATV index: 4.7.3.4
created: 2021-08-26
modified: 2021-08-26
comment: Indicates if a vehicle type has parking brake.
domain: Vehicle Type
range: boolean
term status: stable

has part
type: ObjectProperty
domain: Aggregated Object
range: Basic Object
inverse of: is part of

Curvature of the platform
type: DatatypeProperty
Appendix D2 index: 2.3.8
RINF index: 1.2.1.0.6.8
created: 2022-10-27
modified: 2023-03-14
source: oj
comment: Indication of the existence of the curvature of the platform.
domain: Platform edge
range: boolean
term status: stable

has position
type: ObjectProperty
domain: Basic Object
range: Position

Existence of refuelling
type: DatatypeProperty
XML name: ITS_Refuelling
RINF index: 1.2.2.0.4.4
created: 2021-08-10
modified: 2024-01-08
comment: Indication whether exists an installation for refuelling (fixed installation for servicing trains) as defined in TSI INF.
domain: Siding
range: boolean
term status: stable

Permission for regenerative braking
type: DatatypeProperty
ERATV index: 4.7.4.3.1
created: 2020-08-24
modified: 2021-08-06
comment: Indication whether regenerative braking is permitted or not.
domain: Vehicle Type
range: boolean
term status: stable

Existence of sand restocking
type: DatatypeProperty
XML name: ITS_SandRestocking
RINF index: 1.2.2.0.4.5
created: 2021-08-10
modified: 2021-08-10
comment: Indication whether an installation for sand restocking exists (fixed installation for servicing trains).
domain: Siding
range: boolean
term status: stable

Has sanding prevention
type: DatatypeProperty
ERATV index: 4.14.2.12
created: 2021-09-01
modified: 2021-09-01
comment: Possibility of preventing the use of sanding.
domain: Vehicle Type
range: boolean
term status: stable

Schematic overview of the operational point in digital form
type: DatatypeProperty
RINF index: 1.2.0.0.0.7
created: 2023-03-14
modified: 2024-01-08
comment: The existence of a schematic overview of the operational point in digital form.
domain: Operational Point
range: boolean
term status: stable

has set of parameters
type: ObjectProperty
domain: Infrastructure object
range: Subset with common characteristics

Existence of severe climatic conditions
type: DatatypeProperty
XML name: IPP_SevereClimateCon
RINF index: 1.1.1.1.2.8
used in RCC calculations: true
created: 2020-08-24
modified: 2021-09-10
comment: Climatic conditions on the line are severe according to European standard.
domain: Infra Subsystem
range: boolean
term status: stable

Has shunting restrictions
type: DatatypeProperty
ERATV index: 4.8.3
created: 2021-08-31
modified: 2021-08-31
comment: Indicates the presence of shunting restrictions.
domain: Vehicle Type
range: boolean
term status: stable

System separation
type: DatatypeProperty
XML name: EOS_System
RINF index: 1.1.1.2.4.2.1
created: 2021-08-08
modified: 2021-09-12
comment: Indication of existence of system separation.
domain: Energy Subsystem
range: boolean
term status: stable

Existence of train detection system fully compliant with the TSI
type: DatatypeProperty
type: FunctionalProperty
XML name: CCD_TSITrainDetection
RINF index: 1.1.1.3.4.1
RINF index: 1.2.1.1.3.1
created: 2021-08-09
modified: 2024-01-08
source: index077 - ERA ERTMS 033281 v5.pdf
comment: Indication if there is any train detection system installed and fully compliant with the TSI CCS (Annex I, Appendix A, Table A.2 -Index 77).
domain: CCS Subsystem
range: boolean
term status: stable

Existence of toilet discharge
type: DatatypeProperty
XML name: ITS_ToiletDischarge
RINF index: 1.2.2.0.4.1
created: 2021-08-10
modified: 2024-01-08
comment: Indication whether exists an installation for toilet discharge (fixed installation for servicing trains) as defined in TSI INF.
domain: Siding
range: boolean
term status: stable

has topology
type: ObjectProperty
comment: Property linking an infrastructure object by its topological object(s)
domain: Infrastructure object
range: Topological Object
sub property of: topObjectProperty
inverse of: topology Of

Has train integrity confirmation
type: DatatypeProperty
ERATV index: 4.13.1.9
created: 2020-08-31
modified: 2021-09-12
comment: Indication of on-board management system about completeness of the train information.
domain: Vehicle Type
range: boolean
term status: stable

Existence of walkways
type: DatatypeProperty
Appendix D2 index: 3.2.3
RINF index: 1.1.1.1.8.12
RINF index: 1.2.1.0.5.10
RINF index: 1.2.2.0.5.9
created: 2022-10-27
modified: 2023-03-14
source: oj
comment: Indication of existence of walkways.
domain: Tunnel
range: boolean
term status: stable

Existence of water restocking
type: DatatypeProperty
XML name: ITS_WaterRestocking
RINF index: 1.2.2.0.4.3
created: 2021-08-10
modified: 2024-01-08
comment: Indication whether exists an installation for water restocking (fixed installation for servicing trains) as defined in TSI INF.
domain: Siding
range: boolean
term status: stable

Has wheel slide protection system
type: DatatypeProperty
ERATV index: 4.7.8
created: 2021-08-31
modified: 2021-08-31
comment: Indicates the presence of a wheel slide protection system.
domain: Vehicle Type
range: boolean
term status: stable

Hash source
type: AnnotationProperty
created: 2024-02-06
comment: This property indicates for each infrastructure element, the source, i.e. the identifier or key that was input to the hash function in order to generate the hash value that is part of the hash URI.
domain: Infrastructure object
range: string

Compliance of structures with the High Speed Load Model (HSLM)
type: DatatypeProperty
XML name: IPP_HSLMCompliant
RINF index: 1.1.1.1.2.4.2
used in RCC calculations: true
created: 2020-08-24
modified: 2024-01-08
comment: For sections of line with a maximum permitted speed of 200 km/h or more. Information regarding the procedure to be used to perform the dynamic compatibility check.
domain: Infra Subsystem
range: boolean
term status: stable

direction of measurement of trackside HABD
type: ObjectProperty
XML name: IHS_HABDDirecton
in SKOS Concept Scheme: HotAxleBoxDetectorDirections
RINF index: 1.1.1.1.7.9
used in RCC calculations: true
created: 2022-07-08
modified: 2024-01-08
comment: Specific for the French Italian and Swedish networks. Applicable if trackside HABD is not TSI compliant, direction of measurement of trackside Hot Axle Box Detector. If the direction of measurement is: - the same as the direction defined by the start and end of the SoL: (N) - the opposite to the direction defined by the start and end of the SoL: (O) - both directions: (B).
comment: This property was previously a datatype property with domain Track and range string. As its values are a list of three predefined values, it is now a SKOS.
domain: Infra Subsystem
range: Concept
sub property of: topObjectProperty
term status: stable

Generation of trackside HABD
type: DatatypeProperty
XML name: IHS_HABDGen
RINF index: 1.1.1.1.7.7
used in RCC calculations: true
created: 2020-08-24
modified: 2021-09-11
comment: Specific for the French Italian and Swedish networks. Generation of trackside hot axle box detector.
domain: Infra Subsystem
range: string
term status: stable

Identification of trackside HABD
type: DatatypeProperty
XML name: IHS_HABDID
RINF index: 1.1.1.1.7.6
used in RCC calculations: true
created: 2020-08-24
modified: 2021-09-11
comment: Specific for the French, Italian and Swedish networks. Applicable if trackside HABD is not TSI compliant, identification of trackside hot axle box detector.
domain: Infra Subsystem
range: string
term status: stable

Railway location of trackside HABD
type: DatatypeProperty
XML name: IHS_HABDLoc
RINF index: 1.1.1.1.7.8
used in RCC calculations: true
created: 2020-08-24
modified: 2021-09-11
comment: Specific for the French Italian and Swedish networks. Applicable if trackside HABD is not TSI compliant, localisation of trackside hot axle box detector.
domain: Infra Subsystem
range: double
term status: stable

Trackside HABD TSI compliant
type: DatatypeProperty
XML name: IHS_TSIHABD
RINF index: 1.1.1.1.7.5
used in RCC calculations: true
created: 2020-08-24
modified: 2021-09-11
comment: Specific for the French, Italian and Swedish networks. Trackside hot axle box detector TSI compliant.
domain: Infra Subsystem
range: boolean
term status: stable

ID [NNNN NNNN] and phone number [NNNN NNNN NNNN NNNN] of ERTMS/ETCS Radio Block Center
type: DatatypeProperty
Appendix D2 index: 3.4.7
RINF index: 1.1.1.3.2.17
RINF index: 1.2.1.1.1.17
created: 2023-03-14
is replaced by: ERTMS/ETCS Radio Block Center (RBC) identifier
is replaced by: ERTMS/ETCS Radio Block Center (RBC) phone number
modified: 2024-04-18
comment: Unique RBC identification (NID_C+NID_RBC) and calling number (NID_RADIO) as defined in the specification referenced in TSI CCS.
domain: CCS Subsystem
range: string
deprecated: true
term status: stable

Infrastructure manager (IM)'s code
type: DatatypeProperty
XML name: OPSidingIMCode
XML name: OPSidingTunnelIMCode
XML name: OPTrackIMCode
XML name: OPTrackPlatformIMCode
XML name: OPTrackTunnelIMCode
XML name: SOLIMCode
XML name: SOLTunnelIMCode
Appendix D2 index: 1.1
RINF index: 1.1.0.0.0.1
RINF index: 1.1.1.1.8.1
RINF index: 1.2.1.0.0.1
RINF index: 1.2.1.0.5.1
RINF index: 1.2.1.0.6.1
RINF index: 1.2.2.0.0.1
RINF index: 1.2.2.0.5.1
created: 2021-08-02
description: The Code is a unique identifier for the Infrastructure Manager and it shall be verified on national level. - If the IM is subject to TAF/TAP TSIs, it corresponds to the code used in TAF/TAP TSIs. - In other cases, it corresponds to the "organisation code” assigned by the Agency for the specific needs of the RINF Each Section of Line may concern only one IM.
is replaced by: organisation code
modified: 2024-01-08
modified: 2024-06-03
source: oj
comment: (deprecated) Infrastructure manager means any body or firm responsible in particular for establishing, managing and maintaining railway infrastructure, including traffic management and control-command and signalling; the functions of the infrastructure manager on a network or part of a network may be allocated to different bodies or firms. Definition in (Article 3(2))
domain: Infrastructure manager
range: string
sub property of: Identifier
deprecated: true
term status: stable

In country
type: ObjectProperty
in SKOS Concept Scheme: country
created: 2020-09-01
modified: 2020-11-20
comment: TODO review: Indicates the country in which an entity resides.
domain: Infrastructure object
range: Concept
term status: stable

in SKOS Concept Scheme
type: AnnotationProperty
created: 2022-11-17
comment: Property that links an object SKOS property to a the URI of the corresponding SKOS Concept Scheme.
range: anyURI
term status: stable

Infrastructure manager
type: ObjectProperty
created: 2022-07-07
comment: (deprecated) not in use. Relates any feature implemented in the European railway infrastructure with its infrastructure manager.
domain: Infrastructure object
range: Infrastructure manager
deprecated: true
term status: stable

Special instructions to switch over between different radio systems
type: DatatypeProperty
XML name: CTS_SwitchRadioConditions
Appendix D2 index: 3.4.4
RINF index: 1.1.1.3.8.2.1
RINF index: 1.2.1.1.7.2.1
created: 2022-10-28
modified: 2023-03-14
modified: 2024-04-18
source: oj
comment: Name and/or reference of the document specifying the Special instructions to switch over between different radio systems.
domain: CCS Subsystem
range: string
term status: stable

is part of
type: ObjectProperty
domain: Basic Object
range: Aggregated Object

Belonging to a quieter route
type: DatatypeProperty
XML name: IHS_QuietRoute
RINF index: 1.1.1.1.7.11
created: 2020-11-04
modified: 2024-01-08
comment: Belonging to a 'quieter route' in accordance with Article 5b of TSI NOI.
domain: Infra Subsystem
range: boolean
term status: stable

kilometer
type: DatatypeProperty
XML name: OPRailwayLocation
Appendix D2 index: 2.2.2
RINF index: 1.1.1.1.8.12.1
RINF index: 1.1.1.1.8.13.1
RINF index: 1.1.1.3.14.3
RINF index: 1.1.1.3.14.7
RINF index: 1.2.0.0.0.6
RINF index: 1.2.1.0.5.10.1
RINF index: 1.2.1.0.5.11.1
RINF index: 1.2.1.0.8.3
RINF index: 1.2.2.0.5.10.1
RINF index: 1.2.2.0.5.9.1
created: 2021-01-29
modified: 2021-01-29
source: oj
comment: Distance measured in kilometers from the origin of a national railway line.
domain: Class
  union of: Railway location
  union of: Referent
range: double
term status: stable

kilometric post name
type: DatatypeProperty
domain: Referent
range: string
sub property of: topDataProperty
alternative label: mileage post

Other radio systems installed (Radio Legacy Systems)
type: ObjectProperty
XML name: CRS_Installed
Appendix D2 index: 3.1.7
Appendix D2 index: 3.4.4
ERATV index: 4.13.2.3
in SKOS Concept Scheme: LegacyRadioSystems
RINF index: 1.1.1.3.6.1
RINF index: 1.2.1.1.5.1
used in RCC calculations: true
created: 2020-08-31
description: The list is in line with ERA/TD/2011-09/INT (v1.13), Table 4.
modified: 2021-09-12
modified: 2024-04-18
source: oj
source: [K] ERA-TD-2011-09-INT-Coded restrictions-final.pdf
comment: Indication of radio legacy systems installed.
domain: Class
  union of: CCS Subsystem
  union of: Vehicle Type
range: Concept
term status: stable

Length
type: DatatypeProperty
XML name: IPL_Length
XML name: IPP_Length
XML name: ITU_Length
XML name: SIG_NSTALength
XML name: SOLLength
Appendix D2 index: 2.3.6
Appendix D2 index: 3.2.3
Appendix D2 index: 3.2.4
ERATV index: 4.8.1
RINF index: 1.1.0.0.0.5
RINF index: 1.1.1.1.8.12.1
RINF index: 1.1.1.1.8.13.1
RINF index: 1.1.1.1.8.7
RINF index: 1.1.1.3.14.6
RINF index: 1.2.1.0.5.10.1
RINF index: 1.2.1.0.5.11.1
RINF index: 1.2.1.0.5.5
RINF index: 1.2.2.0.2.1
RINF index: 1.2.2.0.5.10.1
RINF index: 1.2.2.0.5.5
RINF index: 1.2.2.0.5.9.1
Unit of measure: http://qudt.org/vocab/unit/M
used in RCC calculations: true
created: 2021-04-01
modified: 2024-01-08
source: oj
comment: Length of an infrastructure object which can be - a section of line (For operational length, use era:lengthOfSectionOfLine), - a tunnel (For operational length, use era:lengthOfTunnel), - a platform (For its usable length, use era:lengthOfPlatform), - a siding (For its usable length, use era:lengthOfSiding), and - length of other areas such as - a non-stopping area (accuracy +- 10m), - a walkway, - an evacuation and rescue point. Vehicle length.
domain: Infra Subsystem
range: double
term status: stable

Usable length of platform
type: DatatypeProperty
XML name: IPL_Length
RINF index: 1.2.1.0.6.4
Unit of measure: http://qudt.org/vocab/unit/M
used in RCC calculations: true
created: 2024-05-16
comment: The maximum continuous length (expressed in metres) of that part of platform in front of which a train is intended to remain stationary in normal operating conditions for passengers to board and alight from the train, making appropriate allowance for stopping tolerances.
domain: Platform edge
range: double
sub property of: Length
term status: stable

Length of section of line
type: DatatypeProperty
XML name: SOLLength
RINF index: 1.1.0.0.0.5
Unit of measure: KiloM
used in RCC calculations: true
created: 2024-05-16
comment: Length between operational points at start and end of section of line.
domain: Section Of Line
range: double
sub property of: Length
term status: stable

Usable length of siding
type: DatatypeProperty
XML name: IPP_Length
RINF index: 1.2.2.0.2.1
Unit of measure: https://qudt.org/vocab/unit/M
used in RCC calculations: true
created: 2024-05-16
comment: Total length of the siding/stabling track expressed in metres where trains can be parked safely.
domain: Siding
range: double
sub property of: Length
term status: stable

Length of tunnel
type: DatatypeProperty
XML name: ITU_Length
RINF index: 1.1.1.1.8.7
RINF index: 1.2.1.0.5.5
RINF index: 1.2.2.0.5.5
Unit of measure: http://qudt.org/vocab/unit/M
used in RCC calculations: true
created: 2024-05-16
comment: Length of a tunnel in metres from entrance portal to exit portal.
domain: Tunnel
range: double
sub property of: Length
term status: stable

Letter marking
type: DatatypeProperty
ERATV index: 4.1.7
created: 2021-08-25
modified: 2021-08-25
comment: letter marking
domain: Vehicle Type
range: string
term status: stable

category of line
type: ObjectProperty
XML name: IPP_LineCat
in SKOS Concept Scheme: LineCategories
RINF index: 1.1.1.1.2.2
RINF index: 1.2.1.0.2.2
created: 2021-08-02
modified: 2024-01-08
comment: Classification of a line according to the TSI INF.
domain: Infra Subsystem
range: Concept
term status: stable

National line identification
type: ObjectProperty
XML name: SOLLineIdentification
Appendix D2 index: 2.2.1.1
RINF index: 1.1.0.0.0.2
created: 2020-09-30
modified: 2023-03-14
comment: Unique line identification or unique line number within Member State.
domain: Class
  union of: Railway location
  union of: Section Of Line
range: National railway line
deprecated: true
term status: stable

Railway location of an infrastructure object
type: ObjectProperty
created: 2021-01-29
modified: 2023-03-14
comment: Indicates a relationship with a national railway line at a specific kilometer point.
domain: Infrastructure object
range: Railway location
term status: stable

End of tunnel kilometer
type: ObjectProperty
XML name: SOLTunnelEnd
RINF index: 1.1.1.1.8.4
created: 2024-02-05
comment: Part of the End of tunnel that indicates the km of the line at the end of a tunnel. The End of tunnel is the Geographical coordinates in decimal degrees and km of the line at the end of a tunnel.
domain: Tunnel
range: Railway location
sub property of: Railway location of an infrastructure object
term status: stable

Start of tunnel kilometer
type: ObjectProperty
XML name: SOLTunnelStart
RINF index: 1.1.1.1.8.3
created: 2024-02-05
comment: Part of the Start of tunnel that indicates the km of the line at the beginning of a tunnel. The Start of tunnel is the Geographical coordinates in decimal degrees and km of the line at the end of a tunnel.
domain: Tunnel
range: Railway location
sub property of: Railway location of an infrastructure object
term status: stable

Linear coordinate
type: DatatypeProperty
created: 2021-04-01
modified: 2023-11-10
comment: Indicates the position of an object within a linear positioning system. For example, relative to a national railway line. The reason for deprecation is that this property is not specified in the latest legal text nor the RINF application guide. Also, no data has been provided for this property.
range: double
deprecated: true
term status: stable

Lineside distance indication appearance
type: ObjectProperty
Appendix D2 index: 3.1.3
RINF index: 1.1.1.0.0.3
created: 2022-10-27
modified: 2023-03-14
source: oj
comment: Indication of types of appearance of track lineside distance indications.
domain: Technical Characteristics
range: Concept
term status: unstable

Lineside distance indication frequency
type: DatatypeProperty
Appendix D2 index: 3.1.3
RINF index: 1.1.1.0.0.3
created: 2022-10-27
modified: 2023-03-14
source: oj
comment: Frequency of track lineside distance indications.
domain: Technical Characteristics
range: integer
term status: stable

Lineside distance indication positioning
type: ObjectProperty
Appendix D2 index: 3.1.3
RINF index: 1.1.1.0.0.3
created: 2023-03-14
source: oj
comment: Indication of the side along the track where the lineside indication is positioned (left or right).
domain: Technical Characteristics
range: Concept
sub property of: topObjectProperty
term status: unstable

Load Capability
type: ObjectProperty
XML name: IPP_LoadCap
in SKOS Concept Scheme: LoadCapabilities
RINF index: 1.1.1.1.2.4
created: 2020-08-24
is replaced by: Load capability
is replaced by: Load capability line category
is replaced by: Load capability speed
is replaced by: Track load capability
modified: 2023-01-20
comment: A combination of the line category and speed at the weakest point of the track.The reason for deprecation is that the load capability property 1.1.1.1.2.4 was defined incorrectly as a SKOS property. It is composed of two values: (1) line category, and (2) speed. Only line category is a list of predefined values (SKOS), whereas speed is an integer (according to the RINF application guide).
domain: Infra Subsystem
range: Concept
deprecated: true
term status: stable

Load capability line category
type: ObjectProperty
XML name: IPP_LoadCap
in SKOS Concept Scheme: LoadCapabilityLineCategories
RINF index: 1.1.1.1.2.4
used in RCC calculations: true
created: 2023-01-20
comment: Part of the load capability of a track that corresponds to the line category of the load model. The load capability is a value selected from the list of load models representing: line category which is amended by value of speed [km/h] permitted for a specific load model. The list of values may also be Route Availability which is amended by value of speed [miles/h] permitted for a specific load model.
domain: Load capability
range: Concept
term status: stable

Load capability speed
type: DatatypeProperty
XML name: IPP_LoadCap
RINF index: 1.1.1.1.2.4
Unit of measure: KiloM-PER-HR
used in RCC calculations: true
created: 2023-01-20
comment: Part of the load capability of a track that corresponds to the speed of the load model. The load capability is a value selected from the list of load models representing: line category which is amended by value of speed [km/h] permitted for a specific load model. The list of values may also be Route Availability which is amended by value of speed [miles/h] permitted for a specific load model.
domain: Load capability
range: integer
term status: stable

Loading platform height
type: DatatypeProperty
ERATV index: 4.8.7
created: 2021-08-31
modified: 2021-08-31
comment: Height of loading platform (for flat wagons and combined transport), given in mm.
domain: Vehicle Type
range: integer
term status: stable

Existence of rules and restrictions of a strictly local nature
type: DatatypeProperty
XML name: RUL_LocalRulesOrRestrictions
RINF index: 1.1.1.4.1
RINF index: 1.2.3.1
created: 2021-08-09
modified: 2021-09-12
comment: Existence of rules and restrictions of a strictly local nature.
domain: Class
  union of: Operational Point
  union of: Running track
range: boolean
term status: stable

Documents regarding the rules or restrictions of a strictly local nature available by the IM
type: ObjectProperty
XML name: RUL_LocalRulesOrRestrictionsDocRef
RINF index: 1.1.1.4.2
RINF index: 1.2.3.2
created: 2021-08-09
modified: 2023-01-20
modified: 2024-04-23
comment: Electronic document available from the IM stored by the Agency providing additional information.
domain: Class
  union of: Operational Point
  union of: Running track
range: ERA Document
term status: stable
change note: Change from datatype property to object property in order to point to the class Document (reference document)

location
type: ObjectProperty
domain: Topological Object
range: Base Location

line referencing system
type: ObjectProperty
comment: The preferred line referencing system. TODO: provide example
domain: Position
range: ConceptScheme
sub property of: topObjectProperty

M_NVCONTACT
type: ObjectProperty
type: FunctionalProperty
XML name: CPE_MNVCONTACT
Appendix D3 index: 1.5.9
in SKOS Concept Scheme: ETCSReactionsNVContact
RINF index: 1.1.1.3.2.16.9
RINF index: 1.2.1.1.1.16.9
created: 2022-11-07
modified: 2023-03-14
modified: 2024-04-18
requires: Only applicable when selected value for 1.1.1.3.2.1 (ETCS present).
source: oj
comment: On-Board system reaction when T_NVCONTACT expires. See: TSI CCS (Subset-026, chapter 7. 7.5.1.74 M_NVCONTACT)
domain: CCS Subsystem
range: Concept
term status: unstable

M_NVDERUN
type: DatatypeProperty
type: FunctionalProperty
XML name: CPE_MNVDERUN
Appendix D3 index: 1.5.10
RINF index: 1.1.1.3.2.16.10
RINF index: 1.2.1.1.1.16.10
created: 2022-11-07
modified: 2023-03-14
modified: 2023-04-18
requires: Only applicable when selected value for 1.1.1.3.2.1 (ETCS present).
source: oj
comment: Entry of Driver ID permitted while running. See: TSI CCS (Subset 26, chapter 7. 7.5.1.75 M_NVDERUN)
domain: CCS Subsystem
range: boolean
term status: stable

Magnetic brake prevention
type: DatatypeProperty
ERATV index: 4.7.4.2.2
created: 2020-08-24
modified: 2021-04-13
comment: Possibility of preventing the use of the magnetic track brake (only if fitted with magnetic brake)
domain: Vehicle Type
range: boolean
term status: stable

Use of magnetic brakes
type: ObjectProperty
XML name: ILR_MagneticBrakes
Appendix D2 index: 3.4.6
in SKOS Concept Scheme: MagneticBraking
RINF index: 1.1.1.1.6.3
RINF index: 1.2.1.0.4.3
used in RCC calculations: true
created: 2020-08-24
modified: 2022-09-12
source: oj
comment: Indication of limitations on the use of magnetic brakes.
comment: This property has been modified to be a RINF parameter (its eratvIndex is deleted). It is treated as a SKOS by RINF and as a boolean by ERATV. A new ERATV datatype property has been defined, magneticBrakingFitted with boolean values.
domain: Infra Subsystem
range: Concept
term status: stable

Document with the conditions for the use of magnetic brakes
type: ObjectProperty
XML name: ILR_MBDocRef
Appendix D2 index: 3.4.6
RINF index: 1.1.1.1.6.5
used in RCC calculations: true
created: 2020-08-24
modified: 2021-09-11
modified: 2024-04-23
source: oj
comment: Electronic document available in two EU languages from the IM stored by the Agency with conditions for the use of magnetic brakes identified in 1.1.1.1.6.3.
domain: Infra Subsystem
range: ERA Document
term status: stable
change note: Change from datatype property to object property in order to point to the class Document (reference document)

Magnetic braking fitted
type: DatatypeProperty
ERATV index: 4.7.4.2.1
created: 2022-09-12
comment: Magnetic track brake fitted. New property defined to distinguish it from magneticBraking which is a RINF SKOS property.
domain: Vehicle Type
range: boolean
term status: stable

manufactured by
type: ObjectProperty
created: 2020-07-29
modified: 2020-11-19
modified: 2024-06-03
comment: Vehicle manufacturer company.
domain: Vehicle Type
range: Body
term status: stable

Manufacturing country
type: ObjectProperty
in SKOS Concept Scheme: country
created: 2020-09-30
modified: 2020-11-22
comment: Indicates the country in which a vehicle or vehicle type is manufactured.
domain: Class
  union of: Vehicle
  union of: Vehicle Type
range: Concept
term status: stable

Mass per wheel
type: DatatypeProperty
ERATV index: 4.5.6
created: 2021-08-26
modified: 2021-08-26
comment: Mass per wheel, given in kg.
domain: Vehicle Type
range: integer
term status: stable

Maximum current at standstill per pantograph
type: DatatypeProperty
XML name: ECS_MaxStandstillCurrent
Appendix D2 index: 3.3.8
ERATV index: 4.10.4
RINF index: 1.1.1.2.2.3
RINF index: 1.2.2.0.6.1
Unit of measure: http://qudt.org/vocab/unit/A
used in RCC calculations: true
created: 2020-08-25
modified: 2021-09-12
source: oj
comment: Indication of the maximum allowable train current at standstill expressed in amperes.
domain: Class
  union of: Contact Line System
  union of: Vehicle Type
range: double
term status: stable

Maximum permitted distance between two consecutive axles in case of TSI non-compliance
type: DatatypeProperty
XML name: CTD_MaxDistConsecutiveAxles
ERATV index: 4.14.2.1
RINF index: 1.1.1.3.7.2.2
Unit of measure: MilliM
created: 2021-08-08
modified: 2023-03-14
comment: Deprecated according to the ammendment to the Regulation (EU) 2019/777. However, the parameter remains as it is also an ERATV parameter. Indication of maximum permitted distance between two consecutive axles in case of TSI non-compliance, given in millimetres.
domain: Class
  union of: Train Detection System
  union of: Vehicle Type
range: integer
term status: stable

Maximum distance between end of train and first axle
type: DatatypeProperty
XML name: CTD_MaxDistEndTrainFirstAxle
RINF index: 1.1.1.3.7.5
Unit of measure: MilliM
created: 2021-08-08
modified: 2023-03-14
comment: Deprecated according to the ammendment to the Regulation (EU) 2019/777. Indication of maximum distance between end of train and first axle, given in millimetres, applicable for both sides (front and rear) of a vehicle or train.
domain: Train Detection System
range: integer
deprecated: true
term status: stable

Maximum permitted height of the flange
type: DatatypeProperty
XML name: CTD_MaxFlangeHeight
ERATV index: 4.14.2.9
RINF index: 1.1.1.3.7.10
Unit of measure: MilliM
created: 2021-08-08
modified: 2023-03-14
comment: Deprecated according to the ammendment to the Regulation (EU) 2019/777. However, the parameter remains as it is also an ERATV parameter. Maximum permitted flange height, given in millimiters.
domain: Class
  union of: Train Detection System
  union of: Vehicle Type
range: double
term status: stable

Maximum permitted impedance between opposite wheels of a wheelset when not TSI compliant
type: DatatypeProperty
XML name: CTD_MaxImpedanceWheelset
ERATV index: 4.14.2.16
RINF index: 1.1.1.3.7.15.2
created: 2021-08-08
modified: 2023-03-14
comment: The value of maximum permitted impedance given in ohm in case of TSI non-compliance. Deprecated according to the amendment to the Regulation (EU) 2019/777.
domain: Class
  union of: Train Detection System
  union of: Vehicle Type
range: double
deprecated: true
term status: stable

Maximum length vehicle nose
type: DatatypeProperty
ERATV index: 4.14.2.4
created: 2021-09-01
modified: 2021-09-01
comment: Maximum length of the vehicle nose.
domain: Vehicle Type
range: integer
term status: stable

Maximum amount of sand
type: ObjectProperty
XML name: CTD_MaxSandOutput
in SKOS Concept Scheme: MaxAmountSandings
RINF index: 1.1.1.3.7.17
created: 2021-08-08
modified: 2023-03-14
comment: Maximum amount of sand accepted on the track within value of sanding output for 30s, given in grams. Deprecated according to the ammendment to the Regulation (EU) 2019/777.
domain: Train Detection System
range: Concept
deprecated: true
term status: stable

Maximum train current
type: DatatypeProperty
XML name: ECS_MaxTrainCurrent
Appendix D2 index: 3.3.2
RINF index: 1.1.1.2.2.2
Unit of measure: http://qudt.org/vocab/unit/A
created: 2021-08-06
modified: 2021-08-06
comment: Indication of the maximum allowable train current expressed in amperes.
domain: Contact Line System
range: integer
term status: stable

Maximum altitude
type: DatatypeProperty
RINF index: 1.1.1.1.2.7
Unit of measure: http://qudt.org/vocab/unit/M
created: 2021-08-03
modified: 2022-10-20
comment: Highest point of the section of line above sea level in reference to Normal Amsterdam's Peil (NAP).
domain: Infra Subsystem
range: double
term status: stable

Maximum average deceleration
type: DatatypeProperty
ERATV index: 4.7.1
created: 2021-08-26
modified: 2021-08-26
comment: Maximum train deceleration given in m/s².
domain: Vehicle Type
range: double
term status: stable

Maximum brake thermal energy capacity
type: DatatypeProperty
ERATV index: 4.7.2.1.6
created: 2021-08-26
modified: 2021-08-26
comment: Maximum brake thermal energy capacity given in kJ
domain: Vehicle Type
range: integer
term status: stable

Maximum braking distance requested
type: DatatypeProperty
XML name: CBP_MaxBrakeDist
RINF index: 1.1.1.3.11.1
Unit of measure: http://qudt.org/vocab/unit/M
used in RCC calculations: true
created: 2020-08-24
modified: 2021-09-12
comment: The maximum value of the braking distance [in meters] of a train shall be given for the maximum line speed.
domain: CCS Subsystem
range: integer
term status: stable

Maximum contact wire height
type: DatatypeProperty
XML name: ECS_MaxWireHeight
ERATV index: 4.10.5
RINF index: 1.1.1.2.2.5
Unit of measure: http://qudt.org/vocab/unit/M
used in RCC calculations: true
created: 2020-08-25
modified: 2021-09-11
comment: Indication of the maximum contact wire height expressed in metres.
domain: Class
  union of: Contact Line System
  union of: Vehicle Type
range: double
term status: stable

Maximum design speed
type: DatatypeProperty
ERATV index: 4.1.2.1
created: 2020-08-24
modified: 2020-11-03
comment: Maximum design speed.
domain: Vehicle Type
range: integer
term status: stable

maximum interference current
type: DatatypeProperty
XML name: CCD_IInterferenceMax
RINF index: 1.1.1.3.4.2.1
RINF index: 1.2.1.1.3.2.1
Unit of measure: A-PER-M
created: 2023-03-14
modified: 2024-04-18
source: index077 - ERA ERTMS 033281 v5.pdf
comment: Maximum interference current limits allowed for track circuits for a defined frequency band (to be expressed in A/m).
domain: Train Detection System
range: double
term status: stable

Evaluation parameters if maximum interference current is not measured in the preferred bands
type: DatatypeProperty
type: FunctionalProperty
XML name: CCD_IInterferenceMax
RINF index: 1.1.1.3.4.2.1
RINF index: 1.2.1.1.3.2.1
created: 2024-04-18
source: index077 - ERA ERTMS 033281 v5.pdf
comment: If the preferred frequency bands are not used, (mandatory) description of the parameters for evaluation of compliance. If the preferred frequency bands are used, this parameter is optional.
domain: Train Detection System
range: string
term status: stable

Maximum locomotives coupled
type: DatatypeProperty
ERATV index: 4.1.5
created: 2021-08-25
modified: 2021-08-25
comment: Maximum number of trainsets or locomotives coupled together in multiple operation.
domain: Vehicle Type
range: integer
term status: stable

Maximum magnetic field direction X
type: DatatypeProperty
type: FunctionalProperty
XML name: CCD_ACMagFieldMax
RINF index: 1.1.1.3.4.2.3
RINF index: 1.2.1.1.3.2.3
created: 2023-03-14
requires: The maximumMagneticFieldDirectionX parameter is applicable for axle counters.
source: index077 - ERA ERTMS 033281 v5.pdf
comment: The maximum magnetic field limits allowed for axle counters (in dB µA/m) for a defined frequency band. Direction X.
domain: Maximum magnetic field
range: integer
term status: stable

Maximum magnetic field direction Y
type: DatatypeProperty
type: FunctionalProperty
XML name: CCD_ACMagFieldMax
RINF index: 1.1.1.3.4.2.3
RINF index: 1.2.1.1.3.2.3
created: 2023-03-14
requires: The maximumMagneticFieldDirectionY parameter is applicable for axle counters.
source: index077 - ERA ERTMS 033281 v5.pdf
comment: The maximum magnetic field limits allowed for axle counters (in dB µA/m) for a defined frequency band. Direction Y.
domain: Maximum magnetic field
range: integer
term status: stable

Maximum magnetic field direction Z
type: DatatypeProperty
type: FunctionalProperty
XML name: CCD_ACMagFieldMax
RINF index: 1.1.1.3.4.2.3
RINF index: 1.2.1.1.3.2.3
created: 2023-03-14
requires: The maximumMagneticFieldDirectionZ parameter is applicable for axle counters.
source: index077 - ERA ERTMS 033281 v5.pdf
comment: The maximum magnetic field limits allowed for axle counters (in dB µA/m) for a defined frequency band. Direction Z.
domain: Maximum magnetic field
range: integer
term status: stable

Maximum permitted speed
type: DatatypeProperty
type: FunctionalProperty
XML name: IPP_MaxSpeed
Appendix D2 index: 3.1.4
RINF index: 1.1.1.1.2.5
Unit of measure: KiloM-PER-HR
used in RCC calculations: true
created: 2020-08-24
modified: 2023-03-14
comment: Nominal maximum operational speed on the line as a result of infrastructure, energy and control, command and signalling subsystem characteristics expressed in kilometres/hour.
domain: Infra Subsystem
range: integer
term status: stable

Maximum service break
type: DatatypeProperty
ERATV index: 4.7.7
created: 2021-08-26
modified: 2021-08-26
comment: At maximum service brake: Stopping distance, Maximum deceleration, for the load condition 'design mass under normal payload' at the design maximum speed.
domain: Vehicle Type
range: string
term status: stable

Maximum speed and cant deficiency
type: DatatypeProperty
ERATV index: 4.6.4
created: 2020-08-24
is replaced by: Maximum speed and cant deficiency
is replaced by: Vehicle type maximum cant deficiency
is replaced by: Vehicle type maximum speed
is replaced by: Vehicle type maximum speed and cant deficiency
modified: 2023-04-05
comment: Combination of maximum speed and maximum cant deficiency for which the vehicle was assessed. This property was before an object skos property. The values for this property do not come from a list of predefined values. Thus, the original object property was replaced by this datatype property with range xsd:string. Deprecated because of replacement by a class and two integer properties. The reason is that the property represents two concepts: [number] km/h for maximum speed - [number] mm for maximum cant deificency.
domain: Vehicle Type
range: string
deprecated: true
term status: stable

Maximum speed empty
type: DatatypeProperty
ERATV index: 4.1.2.2
created: 2021-08-24
modified: 2021-08-24
comment: Maximum speed when empty.
domain: Vehicle Type
range: integer
term status: stable

Temperature range (maximum)
type: DatatypeProperty
XML name: IPP_TempRange
ERATV index: 4.3.1
RINF index: 1.1.1.1.2.6
used in RCC calculations: true
created: 2020-08-24
modified: 2021-09-10
comment: Maximum temperature allowed for unrestricted operation access, according to European standard.
domain: Infra Subsystem
range: integer
term status: stable

Maximum train deceleration
type: DatatypeProperty
XML name: ILR_MaxDeceleration
RINF index: 1.1.1.1.6.1
used in RCC calculations: true
created: 2020-08-24
modified: 2021-09-10
comment: Limit for longitudinal track resistance given as a maximum allowed train deceleration and expressed in metres per square second.
domain: Infra Subsystem
range: double
term status: stable

Meets requirement vehicle authorisation
type: DatatypeProperty
ERATV index: 4.1.8
created: 2021-08-25
modified: 2021-08-25
comment: Type meets the requirements necessary for validity of the vehicle authorisation granted by one Member State in other MSs.
domain: Vehicle Type
range: string
term status: stable

Minimum permitted axle load
type: DatatypeProperty
XML name: CTD_MinAxleLoadByVehicleCat
ERATV index: 4.14.2.10
RINF index: 1.1.1.3.7.11.1
Unit of measure: TONNE
created: 2021-08-08
modified: 2023-03-14
comment: Minimum permitted axle load, given in tons.
comment: Should be deprecated according to the ammendment to the Regulation (EU) 2019/777 but remains because it is also a parameter of ERATV.
domain: Class
  union of: Min axle load vehicle category
  union of: Vehicle Type
range: double
term status: stable

Minimum axle load vehicle category
type: ObjectProperty
XML name: CTD_MinAxleLoadByVehicleCat
in SKOS Concept Scheme: MinAxleLoadVehicleCategories
RINF index: 1.1.1.3.7.11.1
created: 2021-08-08
modified: 2023-03-14
comment: Represents the category of vehicle which is amended by value of minimum permitted axle load [tons] (property minAxleLoad). Deprecated according to the ammendment to the Regulation (EU) 2019/777.
domain: Min axle load vehicle category
range: Concept
deprecated: true
term status: stable

Minimum permitted distance between two consecutive axles
type: DatatypeProperty
XML name: CTD_MinDistConsecutiveAxles
ERATV index: 4.14.2.2
RINF index: 1.1.1.3.7.3
Unit of measure: MilliM
created: 2021-08-08
modified: 2023-03-14
comment: Deprecated according to the ammendment to the Regulation (EU) 2019/777. However, the parameter remains as it is also an ERATV parameter.
comment: Indication of minimum permitted distance between two consecutive axles, given in millimetres.
domain: Class
  union of: CCS Subsystem
  union of: Vehicle Type
range: integer
term status: stable

Minimum permitted distance between first and last axle
type: DatatypeProperty
XML name: CTD_MinDistFirstLastAxles
ERATV index: 4.14.2.3
RINF index: 1.1.1.3.7.4
Unit of measure: MilliM
created: 2021-08-08
modified: 2023-03-14
comment: Deprecated according to the ammendment to the Regulation (EU) 2019/777. However, the parameter remains as it is also an ERATV parameter.
comment: Indication of minimum permitted distance between first and last axles, given in millimetres.
domain: Class
  union of: CCS Subsystem
  union of: Vehicle Type
range: integer
term status: stable

Minimum permitted height of the flange
type: DatatypeProperty
XML name: CTD_MinFlangeHeight
ERATV index: 4.14.2.8
RINF index: 1.1.1.3.7.9
Unit of measure: MilliM
created: 2021-08-08
modified: 2021-09-01
comment: Deprecated according to the ammendment to the Regulation (EU) 2019/777. However, the parameter remains as it is also an ERATV parameter.
comment: Minimum permitted flange height, given in millimiters.
domain: Class
  union of: CCS Subsystem
  union of: Vehicle Type
range: double
term status: stable

Minimum permitted thickness of the flange
type: DatatypeProperty
XML name: CTD_MinFlangeThickness
ERATV index: 4.14.2.7
RINF index: 1.1.1.3.7.8
Unit of measure: MilliM
created: 2021-08-08
modified: 2021-09-01
comment: Deprecated according to the ammendment to the Regulation (EU) 2019/777. However, the parameter remains as it is also an ERATV parameter.
comment: Minimum permitted flange thickness, given in millimiters.
domain: Class
  union of: CCS Subsystem
  union of: Vehicle Type
range: double
term status: stable

Minimum permitted width of the rim
type: DatatypeProperty
XML name: CTD_MinRimWidth
ERATV index: 4.14.2.5
RINF index: 1.1.1.3.7.6
Unit of measure: MilliM
created: 2021-08-08
modified: 2023-03-14
comment: Deprecated according to the ammendment to the Regulation (EU) 2019/777. However, the parameter remains as it is also an ERATV parameter.
domain: Class
  union of: CCS Subsystem
  union of: Vehicle Type
range: double
term status: stable

Vehicle impedance
type: ObjectProperty
type: DatatypeProperty
XML name: CCD_TCVehicleImpedance
ERATV index: 4.14.2.17
RINF index: 1.1.1.3.4.2.2
RINF index: 1.2.1.1.3.2.2
created: 2021-09-01
created: 2024-05-30
is replaced by: minimum Vehicle Impedance (Voltage applicable)
is replaced by: minimal vehicle input capacitance
is replaced by: minimal vehicle input impedance
modified: 2023-03-14
modified: 2024-05-30
requires: The parameter minVehicleImpedance is applicable for track circuits.
source: index077 - ERA ERTMS 033281 v5.pdf
comment: [CCCC]+[ZZZZ], with input capacitance [CCCC](Cin) and input impedance [ZZZZ](Zin)
comment: Impedance as defined in the TSI CCS (Annex I, Appendix A, Table A.2 -Index 77). Minimum vehicle impedance (between wheels and pantograph) (only for vehicles equipped for 1500V or 3000V DC). Per Voltage: [1500]: [CCCC]+[ZZZZ], with input capacitance [CCCC](Cin) and input impedance [ZZZZ](Zin) [3000]: [CCCC]+[ZZZZ], idem.
comment: Impedance as defined in the TSI CCS (Annex I, Appendix A, Table A.2 -Index 77). Per Voltage: [1500]: [CCCC]+[ZZZZ], with input capacitance [CCCC](Cin) and input impedance [ZZZZ](Zin) [3000]: [CCCC]+[ZZZZ], idem.
comment: Per voltage: [CCCC]+[ZZZZ], with input capacitance [CCCC](Cin) and input impedance [ZZZZ](Zin) as defined in TSI CCS (Annex I, Appendix A, Table A.2 -Index 77). Verification of compliance with TSI includes application of notified national rules (when they exist).
domain: Class
  union of: Train Detection System
  union of: Vehicle Type
label: minimum vehicle impedance
label: vehicle impedance
range: Minimum Vehicle Impedance
range: string
deprecated: true
term status: stable
alternative label: Minimum vehicle impedance

minimum Vehicle Impedance (Voltage applicable)
type: ObjectProperty
XML name: CCD_TCVehicleImpedance
in SKOS Concept Scheme: EnergySupplySystems
RINF index: 1.1.1.3.4.2.2
RINF index: 1.2.1.1.3.2.2
used in RCC calculations: true
created: 2024-05-30
requires: The parameter minVehicleImpedanceVoltages is applicable for track circuits.
source: index077 - ERA ERTMS 033281 v5.pdf
comment: Indication of the voltage system valid for the minimal impedance value (track circuits).
domain: Minimum Vehicle Impedance
range: Concept
term status: stable

minimal vehicle input capacitance
type: DatatypeProperty
XML name: CCD_TCVehicleImpedance
RINF index: 1.1.1.3.4.2.2
RINF index: 1.2.1.1.3.2.2
Unit of measure: NanoFARAD
used in RCC calculations: true
created: 2024-05-30
requires: The minVehicleInputCapacitance parameter is applicable for track circuits.
source: index077 - ERA ERTMS 033281 v5.pdf
comment: For the selected DC voltage: [CCCC], as input capacitance [CCCC](Cin)
domain: Minimum Vehicle Impedance
range: double
term status: stable

minimal vehicle input impedance
type: DatatypeProperty
XML name: CCD_TCVehicleImpedance
RINF index: 1.1.1.3.4.2.2
RINF index: 1.2.1.1.3.2.2
Unit of measure: MilliH
used in RCC calculations: true
created: 2024-05-30
requires: The minVehicleInputImpedance parameter is applicable for track circuits.
source: index077 - ERA ERTMS 033281 v5.pdf
comment: For the selected DC voltage: [ZZZZ], as input impedance [ZZZZ](Zin)
domain: Minimum Vehicle Impedance
range: double
term status: stable

Minimum permitted wheel diameter
type: DatatypeProperty
XML name: CTD_MinWheelDiameter
ERATV index: 4.14.2.6
RINF index: 1.1.1.3.7.7
Unit of measure: MilliM
created: 2021-08-08
modified: 2023-03-14
comment: Deprecated according to the ammendment to the Regulation (EU) 2019/777. However, the parameter remains as it is also an ERATV parameter.
comment: Minimum permitted wheel diameter, given in millimiters.
domain: Class
  union of: CCS Subsystem
  union of: Vehicle Type
range: integer
term status: stable

Minimum concave vertical radius
type: DatatypeProperty
ERATV index: 4.8.6
created: 2020-08-24
modified: 2020-11-03
comment: Minimum vertical concave curve radius capability.
domain: Vehicle Type
range: integer
term status: stable

Minimum contact wire height
type: DatatypeProperty
XML name: ECS_MinWireHeight
ERATV index: 4.10.5
RINF index: 1.1.1.2.2.6
Unit of measure: http://qudt.org/vocab/unit/M
used in RCC calculations: true
created: 2020-08-25
modified: 2021-09-11
comment: Indication of the minimum contact wire height expressed in metres.
domain: Class
  union of: Contact Line System
  union of: Vehicle Type
range: double
term status: stable

Minimum convex vertical radius
type: DatatypeProperty
ERATV index: 4.8.5
created: 2020-08-24
modified: 2020-11-03
comment: Minimum vertical convex curve radius capability.
domain: Vehicle Type
range: integer
term status: stable

Minimum radius of horizontal curve
type: DatatypeProperty
XML name: ILL_MinRadHorzCurve
ERATV index: 4.8.4
RINF index: 1.1.1.1.3.7
RINF index: 1.2.2.0.3.2
Unit of measure: http://qudt.org/vocab/unit/M
used in RCC calculations: true
created: 2020-08-24
modified: 2021-09-10
comment: Radius of the smallest horizontal curve of the track in metres.
domain: Class
  union of: Infra Subsystem
  union of: Vehicle Type
range: integer
term status: stable

Temperature range (minimum)
type: DatatypeProperty
XML name: IPP_TempRange
ERATV index: 4.3.1
RINF index: 1.1.1.1.2.6
used in RCC calculations: true
created: 2020-08-24
modified: 2021-09-10
comment: Minimum temperature allowed for unrestricted operation access, according to European standard.
domain: Infra Subsystem
range: integer
term status: stable

Minimum radius of vertical curve
type: DatatypeProperty
XML name: ILL_MinRadVertCurve
RINF index: 1.2.2.0.3.3
Unit of measure: http://qudt.org/vocab/unit/M
created: 2020-08-24
is replaced by: Minimum radius of vertical curve crest
is replaced by: Minimum radius of vertical curve hollow
modified: 2023-04-05
comment: Radius of the smallest vertical curve expressed in metres. Deprecated because of replacement by two integer properties The reason is that the property is composed of two values: The first "NNN" is a value of crest, the second "NNN" is a value of hollow, both expressed in metres.
domain: Infra Subsystem
range: string
deprecated: true
term status: stable

Minimum radius of vertical curve crest
type: DatatypeProperty
XML name: ILL_MinRadVertCurve
RINF index: 1.2.2.0.3.3
Unit of measure: http://qudt.org/vocab/unit/M
used in RCC calculations: true
created: 2023-04-05
comment: Part of the minimum radius of vertical curve that indicates the crest. The minimum radius of vertical curve is the radius of the smallest vertical curve expressed in metres.
domain: Infra Subsystem
range: integer
term status: stable

Minimum radius of vertical curve hollow
type: DatatypeProperty
XML name: ILL_MinRadVertCurve
RINF index: 1.2.2.0.3.3
Unit of measure: http://qudt.org/vocab/unit/M
used in RCC calculations: true
created: 2023-04-05
comment: Part of the minimum radius of vertical curve that indicates the hollow. The minimum radius of vertical curve is the radius of the smallest vertical curve expressed in metres.
domain: Infra Subsystem
range: integer
term status: stable

Minimum wheel diameter for fixed obtuse crossings
type: DatatypeProperty
XML name: ISC_MinWheelDiaFixObtuseCrossings
ERATV index: 4.8.2
RINF index: 1.1.1.1.5.2
Unit of measure: MilliM
used in RCC calculations: true
created: 2020-08-24
modified: 2021-09-10
comment: Maximum unguided length of fixed obtuse crossings is based on a minimum wheel diameter in service expressed in millimetres.
domain: Class
  union of: Infra Subsystem
  union of: Vehicle Type
range: integer
term status: stable

Need for more than one train protection, control and warning system required on board
type: DatatypeProperty
RINF index: 1.1.1.3.5.2
created: 2021-08-09
modified: 2023-03-14
comment: Deprecated according to the ammendment to the Regulation (EU) 2019/777. Indication whether more than one train protection, control and warning system is required to be on-board and active simultaneously.
domain: CCS Subsystem
range: boolean
deprecated: true
term status: unstable

national line
type: ObjectProperty
domain: Class
  union of: Referent
  union of: Section Of Line
range: National railway line

national line identifier
type: DatatypeProperty
type: FunctionalProperty
domain: National railway line
range: string
sub property of: topDataProperty

National classification for load capability
type: DatatypeProperty
XML name: IPP_NCLoadCap
RINF index: 1.1.1.1.2.4.1
used in RCC calculations: true
created: 2020-08-24
modified: 2021-09-10
comment: National classification for load capability.
domain: Infra Subsystem
range: string
term status: stable

National fire category of rolling stock required
type: DatatypeProperty
XML name: ITU_NatFireCatReq
RINF index: 1.1.1.1.8.11
RINF index: 1.2.1.0.5.8
RINF index: 1.2.2.0.5.8
used in RCC calculations: true
created: 2020-07-29
modified: 2024-01-08
comment: Categorisation how a passenger train with a fire on board will continue to operate for a defined time period - according to national rules if they exist.
domain: Tunnel
range: string
term status: stable

National Values used for the brake model
type: DatatypeProperty
type: FunctionalProperty
XML name: CPE_NVBRAKEMOD
appendix D3index: 1.5.13
RINF index: 1.1.1.3.2.16.13
RINF index: 1.2.1.1.1.16.13
created: 2023-03-14
modified: 2024-01-08
requires: Only applicable when selected value for 1.1.1.3.2.1 (ETCS present).
source: oj
comment: Set of parameters for adapting the braking curves calculated by the ETCS on-board system to match accuracy, performance and safety margins imposed by the infrastructure manager. It copies the content of Packet 3 or of Packet 203 as defined in the specification referenced in TSI CCS (Annex I, Appendix A, Table A.2 -Subset-026).
domain: CCS Subsystem
range: string
term status: stable

Navigability
type: ObjectProperty
in SKOS Concept Scheme: Navigabilities
RINF index: 1.1.1.0.1.2
RINF index: 1.2.4.1
created: 2021-04-01
modified: 2021-08-03
comment: Indicates the navigation possibilities between two related topological objects.
range: Concept
deprecated: true
term status: stable
alternative label: Internal connection

Net element
type: ObjectProperty
created: 2021-04-01
modified: 2022-09-06
comment: References an associated topological object. The reason for deprecating this property is that it is defined as "References an associated topological object." and the vocabulary has already a property "hasAbstraction" which relates the implementation layer with the topological layer, https://citnet.tech.ec.europa.eu/CITnet/confluence/pages/viewpage.action?pageId=1122974879.
deprecated: true
term status: stable

Non coded restrictions
type: DatatypeProperty
created: 2022-06-15
modified: 2022-06-15
comment: Denotes a non coded restrictions for this particular vehicleType, as a set of sentences.
domain: Vehicle Type
range: string
term status: stable

Not applicable
type: ObjectProperty
created: 2021-09-13
modified: 2021-09-13
comment: Reference to a property that is not applicable.
term status: unstable

Not provided
type: ObjectProperty
created: 2021-09-13
modified: 2023-10-11
comment: Reference to a property that is not provided.
term status: unstable

Number elements rake freight wagons
type: DatatypeProperty
ERATV index: 4.1.6
created: 2021-08-25
modified: 2021-08-25
comment: Number of elements in the rake of freight wagons (only for subcategory 'rake of freight wagons')
domain: Vehicle Type
range: integer
term status: stable

Number of pantographs in contact with OCL
type: DatatypeProperty
ERATV index: 4.10.7
created: 2020-08-25
modified: 2020-11-19
comment: Number of pantographs in contact with the overhead contact line (OCL) (to be indicated for each energy supply system the vehicle is equipped for).
domain: Vehicle Type
range: integer
term status: stable

Number of toilets
type: DatatypeProperty
ERATV index: 4.12.1.2
created: 2021-08-31
modified: 2021-08-31
comment: Number of toilets.
domain: Vehicle Type
range: integer
term status: stable

Ocl type
type: DatatypeProperty
ERATV index: 4.10.9
created: 2020-08-25
modified: 2020-10-03
comment: OCL type.
domain: Vehicle Type
range: string
term status: stable

offset
type: DatatypeProperty
comment: Relative distance from a reference mileage post or any other reference point
domain: Position
range: double
sub property of: topDataProperty
alternative label: relative distance from

on signal grid
type: ObjectProperty
domain: Signal
range: Signals Grid
sub property of: topObjectProperty

Operational point at end of section of line
type: ObjectProperty
XML name: SOLOPEnd
Appendix D2 index: 3.1.2
RINF index: 1.1.0.0.0.4
created: 2021-09-09
modified: 2024-01-08
source: oj
comment: Operational point at the end of section of line (kilometres increasing from start OP to the end OP).
domain: Section Of Line
range: Operational Point
term status: stable

Border point information per country
type: ObjectProperty
created: 2023-01-20
comment: TODO: review, it is in use. Relates an operational point that represents the general information of a border point to the information that each country maintains for the border point.
domain: Operational Point
range: Operational Point
term status: stable

Name of operational point
type: DatatypeProperty
XML name: OPName
Appendix D2 index: 2.3.1
RINF index: 1.2.0.0.0.1
created: 2021-09-13
modified: 2021-09-13
source: oj
comment: Name normally related to the town or village or to traffic control purpose.
domain: Operational Point
range: string
term status: stable

Operational point at start of section of line
type: ObjectProperty
XML name: SOLOPStart
Appendix D2 index: 3.1.1
RINF index: 1.1.0.0.0.3
created: 2021-09-09
modified: 2024-01-08
source: oj
comment: Operational point at the start of section of line (kilometres increasing from start OP to the end OP).
domain: Section Of Line
range: Operational Point
term status: stable

Type of operational point
type: ObjectProperty
XML name: OPType
Appendix D2 index: 2.2.2
Appendix D2 index: 2.3.2
in SKOS Concept Scheme: OperationalPointTypes
RINF index: 1.2.0.0.0.4
created: 2020-07-29
modified: 2021-08-03
source: oj
comment: Type of facility in relation to the dominating operational functions.
domain: Operational Point
range: Concept
term status: stable

Type of track gauge changeover facility
type: DatatypeProperty
XML name: OPTypeGaugeChangeover
RINF index: 1.2.0.0.0.4.1
used in RCC calculations: true
created: 2021-08-11
modified: 2021-08-11
comment: Type of track gauge changeover facility.
domain: Operational Point
range: string
term status: stable

Operating language
type: ObjectProperty
Appendix D2 index: 3.5.1
RINF index: 1.1.0.0.1.2
RINF index: 1.2.0.0.0.8
created: 2022-10-28
modified: 2023-03-14
source: oj
comment: The language or languages used in daily operation by infrastructure manager and published in its Network Statement, for the communication of operational or safety related messages between the staff of the infrastructure manager and the railway undertaking.
range: Concept
term status: unstable

Operational regime
type: ObjectProperty
Appendix D2 index: 3.2.7
RINF index: 1.1.0.0.1.3
created: 2022-10-27
modified: 2024-01-08
source: oj
comment: Double track type.
range: Concept
term status: unstable

Operational restriction
type: ObjectProperty
in SKOS Concept Scheme: Restrictions
created: 2020-11-23
modified: 2021-08-03
comment: Indicates an operational restriction of vehicle or wagon. Parking brake type (if the vehicle is fitted with it).
domain: Vehicle
range: Concept
term status: stable

organisation
type: ObjectProperty
created: 2024-06-03
comment: The organisation managing the infrastructure objet (infrastructure manager)
domain: Infrastructure object
range: Body
term status: stable

organisation code
type: DatatypeProperty
created: 2024-06-03
comment: Four alpha-numeric code allocated by ERA to a body. It represent's the IM code in RINF.
domain: Body
range: string
sub property of: Identifier

orientation
type: ObjectProperty
comment: The orientation of the object in relation to the carrier object. Possible values: Normal, Opposite, Both
domain: Orientation
range: ConceptScheme
sub property of: topObjectProperty

Open street map class
type: ObjectProperty
in SKOS Concept Scheme: OSMClasses
comment: (deprecated) not in use any more
domain: Class
  union of: Subset with common characteristics
  union of: Running track
range: Concept
deprecated: true
term status: stable
definition: Additional concept class according to OpenStreetMap.

Other Cant Deficiency train categories for which the ETCS trackside is configured to provide SSP
type: ObjectProperty
type: FunctionalProperty
XML name: CPE_OtherCantDef
Appendix D3 index: 1.3
in SKOS Concept Scheme: CantDeficiencies
RINF index: 1.1.1.3.2.14.1
RINF index: 1.2.1.1.1.14.1
created: 2023-03-14
modified: 2024-04-18
relation: cant deficiency used for the basic SSP
requires: Only applicable when selected value for 1.1.1.3.2.1 (ETCS present).
source: oj
comment: Essential information for drivers of trains with a worse (lower) tolerated cant deficiency than those for which the ETCS trackside provides SSP (Static Speed Profiles) in conjunction with parameter "Cant Deficiency used for the basic SSP". Subset-026 (3.11.3.2.1.1) definition: b) The “other specific” SSP categories: it groups all other specific SSP categories corresponding to the other international train categories.
domain: CCS Subsystem
range: Concept
term status: unstable

accepted other pantograph heads
type: ObjectProperty
XML name: EPA_OtherHeads
in SKOS Concept Scheme: OtherPantographHeads
RINF index: 1.1.1.2.3.2
used in RCC calculations: true
created: 2022-06-03
modified: 2022-06-03
comment: Indication of pantograph heads which are allowed to be used.
domain: Energy Subsystem
range: Concept
term status: stable

Other train protection, control and warning systems for degraded situation
type: ObjectProperty
type: FunctionalProperty
XML name: CLD_OtherProtectControlWarn
Appendix D2 index: 3.4.1
in SKOS Concept Scheme: OtherProtectionControlWarnings
RINF index: 1.1.1.3.10.2
RINF index: 1.2.1.1.9.2
created: 2021-08-09
description: Selected value shall answer the question whether any other system than ETCS exists on the respective track. The list is in line with ERA/TD/2011-09/INT (v1.13), Table 3.
modified: 2021-09-12
modified: 2024-04-18
requires: Only applicable when selected value for 1.1.1.3.2.1 (ETCS present).
source: http://data.europa.eu/eli/reg_impl/2019/773/2023-09-28
source: oj
comment: Indication of existence of other system than ETCS for degraded situation.
domain: CCS Subsystem
range: Concept
term status: stable

parameter
type: ObjectProperty
domain: Class
  union of: Aggregated Object
  union of: Applicability
  union of: Basic Object
  union of: Subset with common characteristics
range: Technical Characteristics

Parking brake
type: DatatypeProperty
ERATV index: 4.7.3
created: 2022-04-11
modified: 2022-04-11
comment: Indicates whether all vehicles of this type must be equipped with a parking brake.
domain: Vehicle Type
range: boolean
term status: stable

Parking brake mandatory
type: DatatypeProperty
ERATV index: 4.7.3.1
created: 2021-08-26
modified: 2021-08-26
comment: All vehicles of this type must be equipped with a parking brake (parking brake mandatory for vehicles of this type).
domain: Vehicle Type
range: boolean
term status: stable

Parking brake maximum gradient
type: DatatypeProperty
ERATV index: 4.7.3.3
created: 2020-08-24
modified: 2020-11-03
comment: Maximum gradient on which the unit is kept immobilised by the parking brake alone (if the vehicle is fitted with it).
domain: Vehicle Type
range: double
term status: stable

Parking brake type
type: ObjectProperty
ERATV index: 4.7.3.2
in SKOS Concept Scheme: BrakeParkingType
created: 2021-08-26
modified: 2021-08-26
comment: Parking brake type (if the vehicle is fitted with it).
domain: Vehicle Type
range: Concept
deprecated: true
term status: deprecated

Pass-by noise level
type: DatatypeProperty
ERATV index: 4.11.1
created: 2021-08-31
modified: 2021-08-31
comment: Pass-by noise level given in dB(A).
domain: Vehicle Type
range: double
term status: stable

Passes through tunnel
type: ObjectProperty
created: 2020-07-29
modified: 2022-10-27
comment: TODO: review. References a tunnel that a track goes through.
domain: Running track
range: Tunnel
deprecated: true
term status: deprected

Permissible payload
type: DatatypeProperty
ERATV index: 4.5.1
created: 2020-08-24
modified: 2020-11-03
comment: Permissible payload for different line categories.
domain: Vehicle Type
range: string
term status: stable

Permission for charging electric energy storage for traction purposes at standstill
type: DatatypeProperty
RINF index: 1.2.1.0.7.1
created: 2023-03-14
comment: Point at which IM authorises charging of electric energy storage for traction purposes at standstill.
domain: Contact Line System
range: boolean
sub property of: topDataProperty
term status: stable

Permit of use of reflective plates
type: DatatypeProperty
RINF index: 1.1.1.1.7.12
created: 2023-03-14
comment: Sections where is permitted to use the reflective plates on rail freight corridors, with a view to prioritise the current bottlenecks. Specific case for Belgium, France, Italy, Portugal and Spain until 1.1.2026.
domain: Infra Subsystem
range: boolean
term status: stable

Contact force permitted
type: DatatypeProperty
XML name: ERS_ContactForce
RINF index: 1.1.1.2.5.2
Unit of measure: http://qudt.org/vocab/unit/N
used in RCC calculations: true
created: 2020-08-25
modified: 2024-01-08
comment: Indication of contact force allowed expressed in newton.
domain: Energy Subsystem
range: string
term status: stable

Information on phase separation
type: DatatypeProperty
XML name: EOS_InfoPhase
RINF index: 1.1.1.2.4.1.2
created: 2021-08-08
is replaced by: Phase info length
is replaced by: Phase info pantograph lowered
is replaced by: Phase info switch off breaker
is replaced by: Phase info
is replaced by: Phase info Km
is replaced by: Track phase info
modified: 2023-04-05
comment: Indication of required several information on phase separation. Deprecated because of replacement by three properties. The reason is that the property is composed of three values: length [NNN] - the length of the phase separation in metres; switch off breaker [Y/N], single selection of â€˜Y=yesâ€™ or â€˜N=noâ€™ to show whether the breaker has to be switched off; and lower pantograph [Y/N]â€™, single selection of â€˜Y=yesâ€™ or â€˜N=noâ€™ to show whether the pantograph has to be lowered, Km [NNN.NNN] - the location from the start of the line where the new value is valid.
domain: Energy Subsystem
range: string
deprecated: true
term status: stable

Phase info change supply system
type: DatatypeProperty
XML name: EOS_InfoPhase
RINF index: 1.1.1.2.4.1.2
created: 2024-02-05
comment: Part of the phase info of a track that corresponds to the single selection of Y=yes or N=no to show if the energy supply system changes. The phase info is the indication of required several information on phase separation.
domain: Phase info
range: boolean
term status: stable

Phase info distance type
type: DatatypeProperty
XML name: EOS_InfoPhase
RINF index: 1.1.1.2.4.1.2
created: 2024-02-05
comment: Part of the phase info of a track that corresponds to the single selection of 'MIN=minimum' or 'MAX=maximum' to show whether the length is a minimum distance between the inner contact strips of the pantographs or a maximum distance between the outer contact strips of the pantographs. Multiple strings for this parameter are accepted. The phase info is the indication of required several information on phase separation.
domain: Phase info
range: string
term status: stable

Phase info Km
type: DatatypeProperty
XML name: EOS_InfoPhase
RINF index: 1.1.1.2.4.1.2
creator: 2023-04-05
comment: Part of the phase info of a track that indicates the location from the start of the line where the new value is valid. The phase info is the indication of required several information on phase separation.
domain: Phase info
range: double
term status: stable

Phase info length
type: DatatypeProperty
XML name: EOS_InfoPhase
RINF index: 1.1.1.2.4.1.2
Unit of measure: https://qudt.org/vocab/unit/M
created: 2023-04-05
comment: Part of the phase info of a track that corresponds to the length of the phase separation in metres. The phase info is the indication of required several information on phase separation.
domain: Phase info
range: integer
term status: stable

Phase info pantograph lowered
type: DatatypeProperty
XML name: EOS_InfoPhase
RINF index: 1.1.1.2.4.1.2
created: 2023-04-05
comment: Part of the phase info of a track that shows whether a pantograph has to be lowered. The phase info is the indication of required several information on phase separation.
domain: Phase info
range: boolean
term status: stable

Phase info switch off breaker
type: DatatypeProperty
XML name: EOS_InfoPhase
RINF index: 1.1.1.2.4.1.2
created: 2023-04-05
comment: Part of the phase info of a track that shows whether the breaker has to be switched off. The phase info is the indication of required several information on phase separation.
domain: Phase info
range: boolean
term status: stable

Phase separation
type: DatatypeProperty
XML name: EOS_Phase
RINF index: 1.1.1.2.4.1.1
created: 2021-08-08
modified: 2021-09-12
comment: Indication of existence of phase separation and required information.
domain: Energy Subsystem
range: boolean
term status: stable

Platform edge
type: ObjectProperty
created: 2021-08-09
modified: 2023-11-10
comment: TODO: review. Reference to a related platform edge.
domain: Running track
range: Platform edge
term status: stable

height of platform
type: ObjectProperty
XML name: IPL_Height
Appendix D2 index: 2.3.7
in SKOS Concept Scheme: PlatformHeights
RINF index: 1.2.1.0.6.5
used in RCC calculations: true
created: 2021-08-02
modified: 2021-08-02
source: oj
comment: Distance between the upper surface of platform and running surface of the neighbouring track. It is the nominal value expressed in millimetres.
domain: Platform edge
range: Concept
term status: stable

Identification of platform
type: DatatypeProperty
XML name: OPTrackPlatformIdentification
Appendix D2 index: 2.3.5
RINF index: 1.2.1.0.6.2
created: 2021-09-13
modified: 2023-03-14
source: oj
comment: Unique platform identification or platform number within an Operational Point.
domain: Platform edge
range: string
term status: stable

Portable boarding aids
type: DatatypeProperty
ERATV index: 4.12.3.3
created: 2021-08-31
modified: 2021-08-31
comment: Description of any portable boarding aids if considered in the design of the vehicle for meeting the PRM TSI requirements.
domain: Vehicle Type
range: string
term status: stable

Position on A
type: ObjectProperty
in SKOS Concept Scheme: RelationPositions
RINF index: 1.1.1.0.1.2
RINF index: 1.2.4.1
created: 2021-04-03
modified: 2021-08-03
comment: Determines the position of the topological object A in a relation.
range: Concept
deprecated: true
term status: stable
alternative label: Internal connection

Position on B
type: ObjectProperty
in SKOS Concept Scheme: RelationPositions
RINF index: 1.1.1.0.1.2
RINF index: 1.2.4.1
created: 2021-04-03
modified: 2021-08-03
comment: Determines the position of the topological object B in a relation.
range: Concept
deprecated: true
term status: stable
alternative label: Internal connection

Prevent regenerative brake use
type: DatatypeProperty
ERATV index: 4.7.4.3.2
created: 2020-08-24
modified: 2020-11-03
comment: Possibility of preventing the use of the regenerative brake (only if fitted with regenerative brake).
domain: Vehicle Type
range: boolean
term status: stable

Previous vehicle type
type: ObjectProperty
created: 2022-06-15
modified: 2022-06-15
comment: Denotes a the previous VehicleType.
domain: Vehicle Type
range: Vehicle Type
term status: stable

primary location
type: ObjectProperty
domain: Operational Point
range: Primary Location

primary location code
type: DatatypeProperty
XML name: OPTafTapCode
Appendix D2 index: 2.2.2
RINF index: 1.2.0.0.0.3
created: 2024-06-03
comment: Primary location code developed for information exchange in accordance with the TSIs relating to the telematics applications subsystem.
domain: Primary Location
range: string
sub property of: Identifier
incompatible with: OP primary location code
term status: stable

primary location name
type: DatatypeProperty
created: 2024-06-03
domain: Primary Location
range: string

Priority seats
type: DatatypeProperty
ERATV index: 4.12.2.1
created: 2021-08-31
modified: 2021-08-31
comment: Number of priority seats.
domain: Vehicle Type
range: string
term status: stable

Prm accessible toilets
type: DatatypeProperty
ERATV index: 4.12.2.3
created: 2021-08-31
modified: 2021-08-31
comment: Number of PRM accessible toilets.
domain: Vehicle Type
range: integer
term status: stable

Standard combined transport profile number for semi-trailers
type: ObjectProperty
XML name: ILL_ProfileNumSemiTrailers
in SKOS Concept Scheme: ProfileNumbersSemiTrailers
RINF index: 1.1.1.1.3.5
created: 2021-08-03
modified: 2023-03-14
comment: Coding for combined transport for semi-trailers (for all freight and mixed-traffic lines) in accordance with the specification referenced in Appendix A-1, index [B].
domain: Infra Subsystem
range: Concept
term status: stable

Standard combined transport profile number for swap bodies
type: ObjectProperty
XML name: ILL_ProfileNumSwapBodies
in SKOS Concept Scheme: ProfileNumbersSwapBodies
RINF index: 1.1.1.1.3.4
created: 2021-08-03
modified: 2023-03-14
comment: Coding for combined transport with swap bodies (for all freight and mixed-traffic lines) in accordance with the specification referenced in Appendix A-1, index [B]
domain: Infra Subsystem
range: Concept
term status: stable

Train protection legacy system
type: ObjectProperty
XML name: CPO_LegacyTrainProtection
ERATV index: 4.13.1.5
in SKOS Concept Scheme: OtherProtectionControlWarnings
RINF index: 1.1.1.3.5.3
RINF index: 1.2.1.1.4.1
used in RCC calculations: true
created: 2020-08-31
modified: 2021-09-12
modified: 2024-04-18
source: [K] ERA-TD-2011-09-INT-Coded restrictions-final.pdf
comment: Indication of which class B system is installed. The list is in line with ERA/TD/2011-09/INT (v1.13), Table 3.
domain: Class
  union of: CCS Subsystem
  union of: Vehicle Type
range: Concept
term status: stable

Existence of GSM-R roaming to public networks
type: DatatypeProperty
type: FunctionalProperty
XML name: CRG_RoamingPublic
RINF index: 1.1.1.3.3.6
RINF index: 1.2.1.1.2.6
created: 2021-08-09
modified: 2024-01-08
relation: Details on GSM-R roaming to public networks
requires: GSM-R (parameter 1.1.1.3.3.1) must be installed for this parameter to be applicable.
comment: Existence of roaming to a public network. In case of Y, provide the name of the public network(s) under parameter "Details on GSM-R roaming to public networks".
domain: CCS Subsystem
range: boolean
term status: stable

Details on GSM-R roaming to public networks
type: DatatypeProperty
type: FunctionalProperty
XML name: CRG_RoamingPublicDetails
RINF index: 1.1.1.3.3.7
RINF index: 1.2.1.1.2.7
created: 2021-08-09
modified: 2024-01-08
modified: 2024-04-18
requires: GSM-R (parameter 1.1.1.3.3.1) must be installed for this parameter to be applicable.
comment: If roaming to public networks is configured, please: 1. indicate to which networks, for which users and in which areas. 2. list if any GSM-R functionality is not available when roaming to a public network (e.g. REC, Functional Addressing, Group Calls). 3. also add if there is any operational restriction for vehicles that cannot roam into any of the available public networks.
domain: CCS Subsystem
range: string
term status: stable

Q_NVDRIVER_ADHES
type: DatatypeProperty
type: FunctionalProperty
XML name: CPE_QNVDRIVERADHES
Appendix D3 index: 1.5.11
RINF index: 1.1.1.3.2.16.11
RINF index: 1.2.1.1.1.16.11
created: 2024-04-18
requires: Only applicable when selected value for 1.1.1.3.2.1 (ETCS present).
source: oj
comment: Boolean determining whether the driver is allowed to modify the adhesion factor used by the ETCS on-board to calculate the braking curves. See: TSI CCS (Subset 26, chapter 7. 7.5.1.122 Q_NVDRIVER_ADHES)
domain: CCS Subsystem
range: boolean
term status: stable

Q_NVEMRRLS
type: ObjectProperty
type: FunctionalProperty
XML name: CPE_QNVEMRRLS
Appendix D3 index: 1.5.2
in SKOS Concept Scheme: EBReleaseQualifier
RINF index: 1.1.1.3.2.16.2
RINF index: 1.2.1.1.1.16.2
created: 2023-03-14
modified: 2024-04-18
comment: Qualifier defining whether the application of the emergency brake for reasons other than a trip can be revoked as soon as the conditions for it have disappeared or after the train has come to a complete standstill. According to the specification referenced in TSI CCS (Subset-026, chapter 7, 7.5.1.123 Q_NVEMRRLS)
domain: CCS Subsystem
range: Concept
term status: unstable

Q_NVSBTSMPERM
type: DatatypeProperty
type: FunctionalProperty
XML name: CPE_QNVSBTSMPERM
appendix D3index: 1.5.12
RINF index: 1.1.1.3.2.16.12
RINF index: 1.2.1.1.1.16.12
created: 2023-03-14
modified: 2024-04-18
requires: Only applicable when selected value for 1.1.1.3.2.1 (ETCS present).
source: oj
comment: Permission to use service brake in target speed monitoring. See: TSI CCS (Subset-026, chapter 7. 7.5.1.124 Q_NVSBTSMPERM)
domain: CCS Subsystem
range: boolean
term status: stable

Quasi static guiding force
type: DatatypeProperty
ERATV index: 4.5.4
created: 2021-08-26
modified: 2021-08-26
comment: Quasi-static guiding force (if exceeds the limit defined in TSI or not defined in the TSI), given in kN.
domain: Vehicle Type
range: double
term status: stable

Quieter route exempted country
type: ObjectProperty
in SKOS Concept Scheme: country
created: 2020-11-23
modified: 2020-11-23
comment: Country where a vehicle may operate without noise restrictions.
domain: Vehicle
range: Concept
term status: stable

Radio Network ID
type: DatatypeProperty
XML name: CRG_RadioNID
Appendix D2 index: 3.4.4
RINF index: 1.1.1.3.3.13
RINF index: 1.2.1.1.2.13
created: 2023-03-14
modified: 2024-04-18
requires: GSM-R (parameter 1.1.1.3.3.1) must be installed for this parameter to be applicable.
source: oj
comment: Unique identification of the GSM-R network the calling mobile station has to register with, as defined in the specification referenced in TSI CCS. Format: [NNNNNN] with N a decimal number (0÷9)(sh:minCount 1).
domain: CCS Subsystem
range: string
term status: stable

Radio switch over special conditions
type: DatatypeProperty
ERATV index: 4.13.2.4
created: 2021-08-31
modified: 2021-08-31
comment: Special conditions implemented on-board to switch over between different radio systems. Given as combination of systems installed on board ('System XX'_'System YY').
domain: Vehicle Type
range: string
term status: stable

Rail inclination
type: ObjectProperty
XML name: ITP_RailInclination
ERATV index: 4.6.5
in SKOS Concept Scheme: RailInclinations
RINF index: 1.1.1.1.4.3
used in RCC calculations: true
created: 2020-08-24
modified: 2022-10-20
comment: An angle defining the inclination of the head of a rail relative to the running surface.
domain: Class
  union of: Infra Subsystem
  union of: Vehicle Type
range: Concept
term status: stable

Rail system type
type: DatatypeProperty
created: 2022-11-04
modified: 2024-04-18
comment: (deprecated) Type of railway system. Can be "High-speed" or "Conventional". Deprecated due to the lack of information
domain: Subset with common characteristics
range: string
deprecated: true
term status: stable

Raised pantographs distance
type: DatatypeProperty
XML name: EPA_NumRaisedSpeed
RINF index: 1.1.1.2.3.3
Unit of measure: http://qudt.org/vocab/unit/M
used in RCC calculations: true
created: 2023-04-05
comment: Part of the raised pantographs dustance and speed of a track that corresponds to the minimum distance between pantographs, in metres. The raised pantographs distance and speed is the indication of maximum number of raised pantographs per train allowed and minimum spacing centre line to centre line of adjacent pantograph heads, expressed in metres, at the given speed.
domain: Requirements for raised pantographs
range: integer
term status: stable

Requirements for number of raised pantographs and spacing between them, at the given speed
type: DatatypeProperty
XML name: EPA_NumRaisedSpeed
Appendix D2 index: 3.3.4
RINF index: 1.1.1.2.3.3
created: 2020-08-25
modified: 2023-04-05
source: oj
comment: Indication of maximum number of raised pantographs per train allowed and minimum spacing centre line to centre line of adjacent pantograph heads, expressed in metres, at the given speed. Deprecated because of replacement by a class and three integer properties The reason is that the property is composed of three values: [N] is number of pantographs; [NNN] is minimum distance between pantographs, in metres; [NNN] is the speed considered in km/h.
domain: Energy Subsystem
range: string
deprecated: true
term status: stable

Number of pantographs.
type: DatatypeProperty
XML name: EPA_NumRaisedSpeed
RINF index: 1.1.1.2.3.3
used in RCC calculations: true
created: 2023-04-05
comment: Part of the raised pantographs distance and speed of a track that corresponds to the number of pantographs. The raised pantographs distance and speed is the indication of maximum number of raised pantographs per train allowed and minimum spacing centre line to centre line of adjacent pantograph heads, expressed in metres, at the given speed.
domain: Requirements for raised pantographs
range: integer
term status: stable

Raised pantographs speed
type: DatatypeProperty
XML name: EPA_NumRaisedSpeed
RINF index: 1.1.1.2.3.3
Unit of measure: KiloM-PER-HR
used in RCC calculations: true
created: 2023-04-05
comment: Part of the raised pantographs distance and speed of a track that corresponds to the speed considered in km/h. The raised pantographs distance and speed is the indication of maximum number of raised pantographs per train allowed and minimum spacing centre line to centre line of adjacent pantograph heads, expressed in metres, at the given speed
domain: Requirements for raised pantographs
range: integer
term status: stable

ERTMS/ETCS Radio Block Center (RBC) identifier
type: DatatypeProperty
type: FunctionalProperty
XML name: CPE_IDRBC
Appendix D2 index: 3.4.7
RINF index: 1.1.1.3.2.17
RINF index: 1.2.1.1.1.17
created: 2024-04-18
requires: Only applicable when selected value for 1.1.1.3.2.1 (ETCS present).
source: oj
comment: Unique RBC identification (NID_C+NID_RBC) as defined in the specification referenced in TSI CCS. Format: [NNNN NNNN] with N a decimal number (0÷9)
domain: Radio Block Center
range: string
term status: stable

ERTMS/ETCS Radio Block Center (RBC) phone number
type: DatatypeProperty
type: FunctionalProperty
XML name: CPE_PHONERBC
Appendix D2 index: 3.4.7
RINF index: 1.1.1.3.2.17
RINF index: 1.2.1.1.1.17
created: 2024-04-18
requires: Only applicable when selected value for 1.1.1.3.2.1 (ETCS present).
source: oj
comment: Unique RBC calling number (NID_RADIO) as defined in the specification referenced in TSI CCS. Format: [NNNN NNNN NNNN NNNN] with N a decimal number (0÷9)
domain: Radio Block Center
range: string
term status: stable

Reasons for which an ETCS Radio Block Center can reject a train
type: ObjectProperty
type: FunctionalProperty
XML name: CPE_RBCRejectReasons
Appendix D3 index: 1.4
in SKOS Concept Scheme: ETCSRBCRejectionReasons
RINF index: 1.1.1.3.2.15
RINF index: 1.2.1.1.1.15
created: 2022-11-07
modified: 2023-03-14
modified: 2024-04-18
requires: Only applicable when selected value for 1.1.1.3.2.1 (ETCS present).
source: oj
comment: List of cases subject to system design choices made by the infrastructure manager according to the specification referenced in TSI CCS. See: Subset 26, Chapter 5 5.4 Procedure start of mission.
domain: CCS Subsystem
range: Concept
term status: unstable

Steady red lights required
type: DatatypeProperty
XML name: IHS_RedLights
RINF index: 1.1.1.1.7.10
created: 2021-08-08
modified: 2024-01-08
comment: Sections where two steady red lights are required in accordance with TSI OPE.
domain: Infra Subsystem
range: boolean
term status: stable

Reference pass-by noise level
type: DatatypeProperty
ERATV index: 4.11.2
created: 2021-08-31
modified: 2021-08-31
comment: Pass-by noise level was measured under reference conditions.
domain: Vehicle Type
range: boolean
term status: stable

referent
type: ObjectProperty
comment: Points to the referent instance on which the subject is positioned
domain: Position
range: Referent
sub property of: topObjectProperty

Relative distance of the danger point
type: DatatypeProperty
Appendix D2 index: 2.2.3
Appendix D2 index: 2.3.3
RINF index: 1.1.1.3.14.4
RINF index: 1.2.1.0.8.4
Unit of measure: https://qudt.org/vocab/unit/M
created: 2023-03-14
modified: 2024-04-18
comment: Distance in meters to the danger point.
domain: Signal
range: integer
term status: stable

Relative position
type: DatatypeProperty
created: 2021-04-01
modified: 2023-11-10
comment: Indicates the position of an object relative to the linear coordinates of the associated topological object. The reason for deprecation is that this property is not specified in the latest legal text nor the RINF application guide. Also, no data has been provided for this property.
range: double
deprecated: true
term status: stable

Sanding override by driver required
type: DatatypeProperty
XML name: CTD_SandDriverOverride
Appendix D2 index: 3.2.6
RINF index: 1.1.1.3.7.18
created: 2021-08-08
modified: 2023-03-14
source: oj
comment: Indication whether possibility to activate/deactivate sanding devices by driver, according to instructions from the Infrastructure Manager, is required or not. Deprecated according to the ammendment to the Regulation (EU) 2019/777.
domain: Train Detection System
range: boolean
deprecated: true
term status: stable

RINF index
type: AnnotationProperty
created: 2020-11-03
modified: 2020-11-03
comment: Index code used in the original definition of a parameter in RINF.
term status: stable

role
type: ObjectProperty
created: 2024-06-03
domain: Body
range: Organisation Role

fire category of rolling stock required
type: ObjectProperty
XML name: ITU_FireCatReq
Appendix D2 index: 3.2.3
in SKOS Concept Scheme: Categories
RINF index: 1.1.1.1.8.10
RINF index: 1.2.1.0.5.7
RINF index: 1.2.2.0.5.7
used in RCC calculations: true
created: 2020-07-29
modified: 2024-01-08
source: oj
comment: Categorisation how a passenger train with a fire on board will continue to operate for a defined time period. Passenger train fire category in accordance with point 4.1.4 of TSI LOC&PAS.
domain: Infra Subsystem
range: Concept
term status: stable

Safe consist length information from on-board necessary for access the line and SIL
type: ObjectProperty
type: FunctionalProperty
XML name: CPE_SafeConsistLength
in SKOS Concept Scheme: SafeConsistLengthNecessary
RINF index: 1.1.1.3.2.11
RINF index: 1.2.1.1.1.11
created: 2023-03-14
modified: 2024-04-18
requires: Only applicable when selected value for 1.1.1.3.2.1 (ETCS present).
source: oj
comment: Indication whether safe consist train length information from on-board is required to access the line for safety reasons and the required safety integrity level.
domain: CCS Subsystem
range: Concept
term status: stable

Schematic overview of the operational point
type: DatatypeProperty
RINF index: 1.2.0.0.0.7.1
created: 2023-03-14
comment: Document providing the schematic overview of the operational point.
domain: Operational Point
range: anyURI
term status: stable

Shortest distance between pantographs in contact with OCL
type: DatatypeProperty
ERATV index: 4.10.8
created: 2020-08-25
modified: 2021-09-15
comment: Shortest distance between two pantographs in contact with the OCL (to be indicated for each energy supply system the vehicle is equipped for; to be indicated for single and, if applicable, multiple operation) (only if number of raised pantographs is more than 1).
domain: Vehicle Type
range: string
term status: stable

on side
type: ObjectProperty
domain: Orientation
range: ConceptScheme
sub property of: topObjectProperty

Siding
type: ObjectProperty
created: 2021-08-10
modified: 2021-08-10
comment: Reference to a related siding.
domain: Operational Point
range: Siding
term status: stable

Identification of siding
type: DatatypeProperty
XML name: OPSidingIdentification
Appendix D2 index: 2.2.1
Appendix D2 index: 2.2.1.4
RINF index: 1.2.2.0.0.2
created: 2021-09-13
modified: 2023-03-14
source: oj
comment: Unique siding identification or number within an Operational Point.
domain: Siding
range: string
sub property of: Identifier
term status: stable

Name of signal
type: DatatypeProperty
type: FunctionalProperty
Appendix D2 index: 2.2.3
Appendix D2 index: 2.3.3
RINF index: 1.1.1.3.14.1
RINF index: 1.2.1.0.8.1
created: 2023-03-14
modified: 2024-04-18
comment: Operational identifier of the signal (on the track or in OP), as in the operational and maintenance provisions.
domain: Signal
range: string
sub property of: Identifier
term status: stable

Signal orientation
type: ObjectProperty
type: FunctionalProperty
XML name: SIG_LocDir
Appendix D2 index: 2.2.3
Appendix D2 index: 2.3.3
in SKOS Concept Scheme: TrackRunningDirections
RINF index: 1.1.1.3.14.3
RINF index: 1.2.1.0.8.3
created: 2023-03-14
modified: 2024-04-18
comment: Indication if the signal (on the track or in OP) is applicable for operation on normal, opposite track direction or if it contains bidirectionally valid information (radio-based system only).
domain: Signal
range: Concept
term status: unstable

Type of signal
type: ObjectProperty
XML name: SIG_Type
Appendix D2 index: 2.2.3
Appendix D2 index: 2.3.3
in SKOS Concept Scheme: SignalTypes
RINF index: 1.1.1.3.14.2
RINF index: 1.2.1.0.8.2
created: 2022-10-27
description: Indicates what function the signal (on the track or in OP) executes in relation to the track/switches.
modified: 2024-01-08
modified: 2024-04-18
source: oj
comment: Signalling information for Route Book compilation.
domain: Signal
range: Concept
term status: unstable

Signalling system type
type: ObjectProperty
Appendix D2 index: 3.2.7
RINF index: 1.1.0.0.1.3
created: 2023-03-14
source: oj
comment: Indication of the signalling system type of the signalling system. The reason for deprecation is that this property has the same RINF index than "operational regime" and this property is part of the definition.
range: Concept
deprecated: true
term status: unstable

Sleeping places
type: DatatypeProperty
ERATV index: 4.12.1.3
created: 2021-08-31
modified: 2021-09-15
comment: Number of sleeping places.
domain: Vehicle Type
range: string
term status: stable

Snow ice hail conditions
type: ObjectProperty
ERATV index: 4.3.3
in SKOS Concept Scheme: IceConditions
created: 2020-08-24
modified: 2021-08-02
comment: Snow, ice and hail conditions.
domain: Vehicle Type
range: Concept
term status: stable

Nature of Section of Line
type: ObjectProperty
XML name: SOLNature
in SKOS Concept Scheme: SoLNatures
RINF index: 1.1.0.0.0.6
created: 2021-08-08
modified: 2023-03-14
comment: Kind of section of line expressing size of presented data which depends on fact whether it connects OPs generated by division of a big node into several OPs or not.
domain: Section Of Line
range: Concept
term status: stable

Special area type
type: ObjectProperty
Appendix D2 index: 3.2.3
Appendix D2 index: 3.2.4
Appendix D2 index: 3.2.5
Appendix D2 index: 3.2.6
Appendix D2 index: 3.3.5
Appendix D2 index: 3.3.6
in SKOS Concept Scheme: SpecialAreaTypes
RINF index: 1.1.0.0.1.1
created: 2022-10-27
modified: 2023-03-14
modified: 2024-04-18
comment: Indicates the special area or location types such as safe areas and restricted area types.
domain: Special area
range: Concept
term status: unstable

Special tunnel area
type: ObjectProperty
Appendix D2 index: 3.2.3
created: 2022-10-27
source: oj
comment: Relates a tunnel with a special area or location.
domain: Tunnel
range: Special tunnel area
term status: stable

Specific information
type: DatatypeProperty
XML name: ILL_SpecificInfo
RINF index: 1.1.1.1.3.5.1
created: 2021-08-03
modified: 2021-09-10
comment: Any relevant information from the IM relating to the line layout.
domain: Infra Subsystem
range: string
term status: stable

Standard combined transport profile number for roller units
type: ObjectProperty
RINF index: 1.1.1.1.3.9
created: 2023-03-14
comment: Coding for combined transport for roller units (for all freight and mixed-traffic lines) in accordance with the specification referenced in Appendix A-1, index [B].
domain: Infra Subsystem
range: Concept
term status: unstable

Standard combined transport profile number for containers
type: ObjectProperty
RINF index: 1.1.1.1.3.8
created: 2023-03-14
comment: Coding for combined transport for containers (for all freight and mixed-traffic lines) in accordance with the specification referenced in Appendix A-1, index [B].
domain: Infra Subsystem
range: Concept
term status: unstable

Start intrinsic coordinate
type: DatatypeProperty
created: 2021-04-01
modified: 2021-04-01
comment: TODO review: Indicates the coordinate point where a linear object begins.
range: double
deprecated: true
term status: stable

Start of tunnel location
type: ObjectProperty
XML name: SOLTunnelStart
RINF index: 1.1.1.1.8.3
created: 2020-07-29
modified: 2024-02-05
comment: Part of the Start of tunnel that indicates the Geographical coordinates according to the standard World Geodetic System (WGS). Precision for both geographical latitude and geographical longitude is assumed as [NN.NNNNNNN] in degrees with decimals what gives discretion of 10 cm in the network. The Start of tunnel is the Geographical coordinates in decimal degrees and km of the line at the beginning of a tunnel.
domain: Tunnel
range: Class
  union of: Geometry
  union of: Point
sub property of: hasGeometry
sub property of: Location
term status: stable

Starting noise level
type: DatatypeProperty
ERATV index: 4.11.4
created: 2021-08-31
modified: 2021-08-31
comment: starting noise level given in dB(A).
domain: Vehicle Type
range: double
term status: stable

State
type: ObjectProperty
in SKOS Concept Scheme: States
created: 2022-06-15
modified: 2022-06-15
comment: Denoting the state of the certificate Can be in one of the following: Amended, New, Suspended, Withdrawn.
domain: Certificate
range: Concept
term status: stable

Static axle load under exceptional payload
type: DatatypeProperty
ERATV index: 4.5.3.3
created: 2020-08-24
modified: 2020-11-03
comment: Static axle load under exceptional payload.
domain: Vehicle Type
range: double
term status: stable

Static axle load under normal payload
type: DatatypeProperty
ERATV index: 4.5.3.2
created: 2020-08-24
modified: 2020-11-03
comment: Static axle load under normal payload.
domain: Vehicle Type
range: double
term status: stable

Static axle load in working order
type: DatatypeProperty
ERATV index: 4.5.3.1
created: 2020-08-24
modified: 2020-11-03
comment: Static axle load in working order.
domain: Vehicle Type
range: double
term status: stable

Stationary noise level
type: DatatypeProperty
ERATV index: 4.11.3
created: 2021-08-31
modified: 2021-08-31
comment: stationary noise level given in dB(A).
domain: Vehicle Type
range: double
term status: stable

Structural category
type: DatatypeProperty
ERATV index: 4.1.10
created: 2021-08-25
modified: 2021-08-25
comment: Structural category.
domain: Vehicle Type
range: string
term status: stable

Railway location of structures requiring specific checks
type: DatatypeProperty
XML name: IPP_StructureCheckLoc
RINF index: 1.1.1.1.2.4.3
used in RCC calculations: true
created: 2020-08-24
modified: 2023-03-14
comment: Localisation of structures requiring specific checks.
domain: Infra Subsystem
range: double
term status: stable

Vehicle subcategory
type: ObjectProperty
ERATV index: 1.5
in SKOS Concept Scheme: Categories
created: 2020-07-29
modified: 2021-08-03
comment: Vehicle subcategory.
domain: Vehicle Type
range: Concept
term status: stable

Name of a subset with common characteristics
type: DatatypeProperty
created: 2023-03-14
comment: A subset of common characteristics is identified with a unique name/id, for example "ETCSbaseline2" which will describe all ETCS National values (1.1.1.3.2.16 group) and it will be the same for a part of the network (set of tracks).
domain: Subset with common characteristics
range: string
term status: stable

has subsidiary location
type: ObjectProperty
domain: Infrastructure object
range: Subsidiary location
sub property of: topObjectProperty

subsidiary location code
type: DatatypeProperty
comment: The numeric code for the subsidiary location
domain: Subsidiary location
range: string

subsidiary location name
type: DatatypeProperty
created: 2024-06-03
comment: The common name given to the subsidiary location
domain: Subsidiary location
range: string

subsidiary location type
type: ObjectProperty
domain: Subsidiary location
range: Concept

Supported platform height
type: ObjectProperty
ERATV index: 4.12.3.1
in SKOS Concept Scheme: PlatformHeights
created: 2020-07-29
modified: 2021-08-02
comment: Platform height for which the vehicle is designed.
domain: Vehicle Type
range: Concept
term status: stable

Existence of switch over between different protection, control and warning systems while running
type: DatatypeProperty
XML name: CTS_SwitchProtectControlWarn
Appendix D2 index: 3.4.2
RINF index: 1.1.1.3.8.1
RINF index: 1.2.1.1.7.1
created: 2021-08-09
modified: 2021-09-12
comment: Indication whether a switch over between different systems whilst running exists.
domain: CCS Subsystem
range: boolean
term status: stable

Existence of switch over between different radio systems
type: DatatypeProperty
XML name: CTS_SwitchRadioSystem
Appendix D2 index: 3.4.4
RINF index: 1.1.1.3.8.2
RINF index: 1.2.1.1.7.2
created: 2021-08-09
modified: 2021-09-12
comment: Indication whether a switch over between different radio systems and no communication system whilst running exists.
domain: CCS Subsystem
range: boolean
term status: stable

Information on system separation
type: DatatypeProperty
XML name: EOS_InfoSystem
RINF index: 1.1.1.2.4.2.2
created: 2021-08-08
is replaced by: System separation info
is replaced by: System separation info Km
is replaced by: System separation info length
is replaced by: System separation info switch off breaker
is replaced by: systemSeparationLoweredPantograph
is replaced by: Track system separation info
modified: 2023-04-05
comment: Indication of required several information on system separation. Deprecated because of replacement by four properties. The reason is that the property is composed of four values: length [NNN], the length of the system separation in metres; switch off breaker [Y/N]. Single selection of â€˜Y=yesâ€™ or â€˜N=noâ€™ to show whether the breaker has to be switched off; lower pantograph [Y/N]. Single selection of â€˜Y=yesâ€™ or â€˜N=noâ€™ to show whether the pantograph has to be lowered, and [CharacterString] to show whether the supply system has to be changed.
domain: Energy Subsystem
range: string
deprecated: true
term status: stable

System separation info change supply system
type: DatatypeProperty
XML name: EOS_InfoSystem
RINF index: 1.1.1.2.4.2.2
created: 2023-04-05
comment: Part of the system separation info of a track that shows whether the supply system has to be changed. The system separation info is the Indication of required several information on system separation.
domain: System separation info
range: string
term status: stable

System separation info Km
type: DatatypeProperty
XML name: EOS_InfoSystem
RINF index: 1.1.1.2.4.2.2
created: 2023-04-05
comment: Part of the system separation info of a track. Indicates the the location from the start of the line where the new value is valid. The system separation info is the Indication of required several information on system separation.
domain: System separation info
range: double
term status: stable

System separation info length
type: DatatypeProperty
XML name: EOS_InfoSystem
RINF index: 1.1.1.2.4.2.2
Unit of measure: https://qudt.org/vocab/unit/M
created: 2023-04-05
comment: Part of the system separation info of a track that shows the length of the system separation in metres. The system separation info is the Indication of required several information on system separation.
domain: System separation info
range: integer
term status: stable

System separation info pantograph lowered
type: DatatypeProperty
XML name: EOS_InfoSystem
RINF index: 1.1.1.2.4.2.2
created: 2023-04-05
comment: Part of the system separation info of a track that shows whether the pantograph has to be lowered. The system separation info is the Indication of required several information on system separation.
domain: System separation info
range: boolean
term status: stable

System separation info switch off breaker
type: DatatypeProperty
XML name: EOS_InfoSystem
RINF index: 1.1.1.2.4.2.2
created: 2023-04-05
comment: Part of the system separation info of a track that shows whether the breaker has to be switched off. The system separation info is the Indication of required several information on system separation.
domain: System separation info
range: boolean
term status: stable

T_NVCONTACT
type: DatatypeProperty
type: FunctionalProperty
XML name: CPE_TNVCONTACT
Appendix D3 index: 1.5.8
RINF index: 1.1.1.3.2.16.8
RINF index: 1.2.1.1.1.16.8
Unit of measure: SEC
created: 2022-11-07
modified: 2023-03-14
modified: 2024-04-18
requires: Only applicable when selected value for 1.1.1.3.2.1 (ETCS present).
source: oj
comment: Maximum time without a safe message from Radio Block Center before train reacts in seconds. Precision: [NNN], with N a decimal number (0÷9), NNN = 255 means ∞ seconds, so values cannot be higher. See: TSI CCS (Subset 26, chapter 7. 7.5.1.148 T_NVCONTACT)
domain: CCS Subsystem
range: integer
term status: stable

T_NVOVTRP
type: DatatypeProperty
type: FunctionalProperty
XML name: CPE_TNVOVTRP
Appendix D3 index: 1.5.6
RINF index: 1.1.1.3.2.16.6
RINF index: 1.2.1.1.1.16.6
Unit of measure: SEC
created: 2022-11-07
modified: 2023-03-14
modified: 2024-04-18
requires: Only applicable when selected value for 1.1.1.3.2.1 (ETCS present).
source: oj
comment: Maximum time for overriding the train trip in seconds. Precision: [NNN], with N a decimal number (0÷9) See: TSI CCS (Subset 26, chapter 7. 7.5.1.149 T_NVOVTRP)
domain: CCS Subsystem
range: integer
term status: stable

OP primary location code
type: DatatypeProperty
XML name: OPTafTapCode
Appendix D2 index: 2.2.2
RINF index: 1.2.0.0.0.3
created: 2020-07-29
modified: 2024-01-08
modified: 2024-06-03
comment: Not used anymore. It has been replaced by era:primaryLocationCode.
domain: Operational Point
range: string
sub property of: Identifier
deprecated: true
term status: stable

Section with train detection limitation, only for the French network
type: ObjectProperty
XML name: CTD_TCLimitation
RINF index: 1.1.1.3.7.1.4
RINF index: 1.2.1.1.6.3
used in RCC calculations: true
created: 2023-04-05
relation: Section with train detection limitation
comment: Relates the class train detection system with the class that represents the section with train detection limitation. Specific for route compatibility check on French network.
domain: Train Detection System
range: Section with train detection limitation
term status: stable

Maximum magnetic field
type: ObjectProperty
XML name: CCD_ACMagFieldMax
RINF index: 1.1.1.3.4.2.3
RINF index: 1.2.1.1.3.2.3
created: 2023-03-14
modified: 2024-04-18
source: index077 - ERA ERTMS 033281 v5.pdf
comment: Relates the Axle Counter TrainDetectionSystem with its MaximumMagneticField in (X,Y,Z). The maximum magnetic field limits allowed for axle counters (in dB µA/m) for a defined frequency band. It should be provided in 3 directions.
domain: Train Detection System
range: Maximum magnetic field
term status: stable

Train detection system min axle load vehicle category
type: ObjectProperty
XML name: CTD_MinAxleLoadByVehicleCat
RINF index: 1.1.1.3.7.11.1
created: 2023-01-25
modified: 2023-03-14
comment: Indication of load given in tons depending of the category of vehicle. Deprecated according to the ammendment to the Regulation (EU) 2019/777.
domain: Train Detection System
range: Min axle load vehicle category
deprecated: true
term status: stable

Temperature range
type: ObjectProperty
XML name: IPP_TempRange
in SKOS Concept Scheme: TemperatureRanges
RINF index: 1.1.1.1.2.6
used in RCC calculations: true
created: 2023-01-20
comment: Temperature range for unrestricted access to the line according European standard.
domain: Infra Subsystem
range: Concept
term status: stable

Trans-European Network (TEN) classification
type: ObjectProperty
XML name: IPL_TENClass
XML name: IPP_TENClass
in SKOS Concept Scheme: TENClassifications
RINF index: 1.1.1.1.2.1
RINF index: 1.2.1.0.2.1
RINF index: 1.2.1.0.6.3
RINF index: 1.2.2.0.0.3
created: 2021-08-02
modified: 2024-01-08
comment: Indicates the part of the trans-European network the (track, platform, siding) belongs to.
domain: Infra Subsystem
range: Concept
term status: stable

TEN geographic information system identity (GIS ID)
type: DatatypeProperty
XML name: IPP_TENGISID
RINF index: 1.1.1.1.2.1.2
created: 2021-08-03
modified: 2024-01-08
comment: Indication of the GIS identity (GIS ID) of the section of TEN-T database to which the track belongs.
domain: Infra Subsystem
range: string
term status: stable

Thermal capacity distance
type: DatatypeProperty
ERATV index: 4.7.2.1.4
created: 2020-08-24
modified: 2020-11-03
comment: Thermal capacity distance. If no reference case is indicated.
domain: Vehicle Type
range: double
term status: stable

Thermal capacity gradient
type: DatatypeProperty
ERATV index: 4.7.2.1.3
created: 2020-08-24
modified: 2020-11-03
comment: Thermal capacity gradient. If no reference case is indicated.
domain: Vehicle Type
range: double
term status: stable

Thermal capacity speed
type: DatatypeProperty
ERATV index: 4.7.2.1.2
created: 2020-08-24
modified: 2020-11-03
comment: Thermal capacity speed. If no reference case is indicated.
domain: Vehicle Type
range: double
term status: stable

Thermal capacity TSI reference
type: ObjectProperty
ERATV index: 4.7.2.1.1
in SKOS Concept Scheme: ThermalCapacityTSIReferences
created: 2020-08-24
modified: 2021-08-02
comment: Reference case of a TSI thermal capacity.
domain: Vehicle Type
range: Concept
term status: stable

Thermal capacity time
type: DatatypeProperty
ERATV index: 4.7.2.1.5
created: 2020-08-24
modified: 2020-11-03
comment: Thermal capacity time. If no reference case is indicated.
domain: Vehicle Type
range: integer
term status: stable

Indication whether tilting functions are supported by ETCS
type: DatatypeProperty
RINF index: 1.1.1.3.12.1
created: 2021-08-09
modified: 2023-03-14
comment: Deprecated according to the ammendment to the Regulation (EU) 2019/777. Indication whether tilting functions are supported by ETCS.
domain: CCS Subsystem
range: boolean
deprecated: true
term status: stable

to
type: ObjectProperty
domain: Linear Element Link
range: Linear Element

topology Of
type: ObjectProperty
comment: Property linking a topological object by its physical implementation infrastructure object
domain: Topological Object
range: Infrastructure object
sub property of: topObjectProperty

Total vehicle mass
type: DatatypeProperty
ERATV index: 4.5.5
created: 2021-08-26
modified: 2021-08-26
comment: Total vehicle mass (for each vehicle of the unit), given in kg.
domain: Vehicle Type
range: integer
term status: stable

Track
type: ObjectProperty
created: 2021-08-09
modified: 2021-09-09
comment: Reference to a related railway track.
domain: Class
  union of: Operational Point
  union of: Section Of Line
  union of: Signal
range: Running track
term status: stable

Normal running direction
type: ObjectProperty
XML name: SOLTrackDirection
Appendix D2 index: 2.2.1.1
in SKOS Concept Scheme: TrackRunningDirections
RINF index: 1.1.1.0.0.2
created: 2021-09-09
modified: 2024-01-08
comment: The normal running direction is: - the same as the direction defined by the start and end of the SoL: (N) - the opposite to the direction defined by the start and end of the SoL: (O) - both directions: (B)
domain: Running track
range: Concept
term status: stable

Identification of track
type: DatatypeProperty
XML name: OPTrackIdentification
XML name: SOLTrackIdentification
Appendix D2 index: 2.2.1.1
RINF index: 1.1.1.0.0.1
RINF index: 1.2.1.0.0.2
created: 2021-09-09
modified: 2024-01-08
source: oj
comment: Unique track identification or unique track number within an OP or a section of line.
domain: Running track
range: string
sub property of: Identifier
term status: stable

Track load capability
type: ObjectProperty
XML name: IPP_LoadCap
RINF index: 1.1.1.1.2.4
used in RCC calculations: true
created: 2023-01-20
comment: Relates the track with the class LoadCapability. A combination of the line category and speed at the weakest point of the track.
domain: Infra Subsystem
range: Load capability
sub property of: topObjectProperty
term status: stable

Track phase info
type: ObjectProperty
XML name: EOS_InfoPhase
RINF index: 1.1.1.2.4.1.2
created: 2023-04-05
comment: Relates the Track with PhaseInfo. Indication of required several information on phase separation.
domain: Energy Subsystem
range: Phase info
term status: stable

Track raised pantograph distance and speed
type: ObjectProperty
XML name: EPA_NumRaisedSpeed
RINF index: 1.1.1.2.3.3
used in RCC calculations: true
created: 2023-04-05
comment: Relates the track with the class RaisePantporaphsDistanceAndSpeed. Indication of maximum number of raised pantographs per train allowed and minimum spacing centre line to centre line of adjacent pantograph heads, expressed in metres, at the given speed.
domain: Energy Subsystem
range: Requirements for raised pantographs
term status: stable

Track system separation info
type: ObjectProperty
XML name: EOS_InfoSystem
RINF index: 1.1.1.2.4.2.2
created: 2023-04-05
comment: Relates the Track with the SystemSeparationInfo. Indication of required several information on system separation.
domain: Energy Subsystem
range: System separation info
term status: stable

Train control switch over special conditions
type: DatatypeProperty
ERATV index: 4.13.1.6
created: 2021-08-31
modified: 2021-08-31
comment: Special conditions implemented on-board to switch over between different train protection control and warning systems. Given as combination of systems installed on board ('System XX'_'System YY').
domain: Vehicle Type
range: string
term status: stable

Train detection system
type: ObjectProperty
created: 2020-07-29
modified: 2021-09-12
comment: Train detection systems installed in the section of line.
domain: CCS Subsystem
range: Train Detection System
term status: stable

Type of track circuits or axle counters to which specific checks are needed.
type: DatatypeProperty
XML name: CTD_TCCheck
RINF index: 1.1.1.3.7.1.2
RINF index: 1.2.1.1.6.1
used in RCC calculations: false
created: 2020-08-24
modified: 2021-08-08
modified: 2024-04-18
relation: Document with the procedure(s) related to the type of train detection systems declared in 1.1.1.3.7.1.2 or 1.2.1.1.6.1
requires: String containing the name of the TD system for which checks are mentioned in 1.1.1.3.7.1.3.
source: index077 - ERA ERTMS 033281 v5.pdf
comment: Reference to the technical specification of train detection system.
domain: Train Detection System
range: string
deprecated: false
term status: stable

Document with the procedure(s) related to the type of train detection systems declared in 1.1.1.3.7.1.2 or 1.2.1.1.6.1
type: ObjectProperty
XML name: CTD_TCCheckDocRef
RINF index: 1.1.1.3.7.1.3
RINF index: 1.2.1.1.6.2
used in RCC calculations: false
created: 2021-08-03
modified: 2024-01-08
modified: 2024-04-18
modified: 2024-04-23
requires: The document itself has to be upload by the NRE via the “reference document management” functionality. The reference of the document is provided for the parameter using the characterstring format.
source: index077 - ERA ERTMS 033281 v5.pdf
comment: Electronic document from the IM stored by the Agency with precise values in accordance with TSI CCS (Article 13 and Annex I, Appendix A, Table A.2, Index 77), for the specific check to be performed for train detection systems identified in parameter ""Type of track circuits or axle counters to which specific checks are needed".
domain: Train Detection System
range: ERA Document
term status: stable
change note: Change from datatype property to object property in order to point to the class Document (reference document)

Type of train detection system
type: ObjectProperty
XML name: CTD_DetectionSystem
ERATV index: 4.14.1
in SKOS Concept Scheme: TrainDetectionSystems
RINF index: 1.1.1.3.7.1.1
RINF index: 1.2.1.1.3.1.1
used in RCC calculations: true
created: 2021-08-07
description: Explanation on data presentation: The option of ‘wheel detector’ has to be also selected for: wheel sensor for axle counter, pedal or treadle.
modified: 2021-08-07
modified: 2024-04-18
requires: Not all parameters are applicable to all types of train detection systems; it depends on the applicability condition.
comment: Indication of types of train detection systems installed.
domain: Class
  union of: Train Detection System
  union of: Vehicle Type
range: Concept
term status: stable

Train integrity confirmation from on-board (not from driver) necessary for line access
type: DatatypeProperty
type: FunctionalProperty
XML name: CPE_IntegrityConfirmation
appendix D2index: 3.4.11
RINF index: 1.1.1.3.2.8
RINF index: 1.2.1.1.1.8
used in RCC calculations: true
created: 2020-08-31
modified: 2021-09-12
modified: 2024-04-18
requires: Parameter only applicable when ETCS Baseline > 4 MR1 with operation requiring train integrity.
comment: Indication whether train confirmation from on-board is required to access the line for safety reasons. In hybrid operation, the confirmation can be optional.
domain: CCS Subsystem
range: Datatype
  one of: N
  one of: Optional
  one of: Y
term status: stable

Transportable on ferry
type: DatatypeProperty
ERATV index: 4.8.8
created: 2021-08-31
modified: 2021-08-31
comment: Indicates the suitability for transport on ferries.
domain: Vehicle Type
range: boolean
term status: stable

Tsi compliant
type: DatatypeProperty
created: 2020-11-03
modified: 2023-01-23
comment: Indicates if a certain property is TSI compliant.The reason for deprecation is that it is used in SKOS "OtherPantographHeads" and "TsiPantographHeads" to indicate in the first case if a SKOS concept is not tsiCompliant (false) and in the second case that the concept is tsiCompliant (true). These two SKOS were originally one SKOS, "PantographHeads". Currently with the two SKOS the property is redundant.
range: boolean
deprecated: true
term status: stable

TSI compliance of rules on the use of composite brake blocks
type: ObjectProperty
XML name: CTD_TSICompositeBrakeBlocks
in SKOS Concept Scheme: TSICompliances
RINF index: 1.1.1.3.7.21
created: 2021-08-08
modified: 2023-03-14
comment: Deprecated according to the ammendment to the Regulation (EU) 2019/777. TSI compliance of rules on the use of composite brake blocks.
domain: Train Detection System
range: Concept
deprecated: true
term status: stable

TSI compliance of Ferromagnetic characteristics of wheel material required
type: ObjectProperty
XML name: CTD_TSIFerroWheelMat
in SKOS Concept Scheme: TSICompliances
RINF index: 1.1.1.3.7.14
created: 2021-08-08
modified: 2023-03-14
comment: TSI compliance of Ferromagnetic characteristics of wheel material required. Deprecated according to the ammendment to the Regulation (EU) 2019/777.
domain: Train Detection System
range: Concept
deprecated: true
term status: stable

TSI compliance of maximum permitted distance between two consecutive axles
type: ObjectProperty
XML name: CTD_TSIMaxDistConsecutiveAxles
in SKOS Concept Scheme: TSICompliances
RINF index: 1.1.1.3.7.2.1
created: 2021-08-07
modified: 2023-03-14
comment: Indication whether required distance between two consecutive axles is compliant with the TSI. Deprecated according to the ammendment to the Regulation (EU) 2019/777.
domain: Train Detection System
range: Concept
deprecated: true
term status: stable

TSI compliance of maximum permitted impedance between opposite wheels of a wheelset
type: ObjectProperty
XML name: CTD_TSIMaxImpedanceWheelset
in SKOS Concept Scheme: TSICompliances
RINF index: 1.1.1.3.7.15.1
created: 2021-08-08
modified: 2023-03-14
comment: TSI compliance of maximum permitted impedance between opposite wheels of a wheelset. Deprecated according to the ammendment to the Regulation (EU) 2019/777.
domain: Train Detection System
range: Concept
deprecated: true
term status: stable

TSI compliance of rules for vehicle metal construction
type: ObjectProperty
XML name: CTD_TSIMetalConstruction
in SKOS Concept Scheme: TSICompliances
RINF index: 1.1.1.3.7.13
created: 2021-08-08
modified: 2023-03-14
comment: TSI compliance of rules for vehicle metal construction. Deprecated according to the ammendment to the Regulation (EU) 2019/777.
domain: Train Detection System
range: Concept
deprecated: true
term status: stable

TSI compliance of rules for metal-free space around wheels
type: ObjectProperty
XML name: CTD_TSIMetalFree
in SKOS Concept Scheme: TSICompliances
RINF index: 1.1.1.3.7.12
created: 2021-08-08
modified: 2023-03-14
comment: TSI compliance of rules for metal-free space around wheels. Deprecated according to the ammendment to the Regulation (EU) 2019/777.
domain: Train Detection System
range: Concept
deprecated: true
term status: stable

TSI compliance of rules on combination of RST characteristics influencing shunting impedance
type: ObjectProperty
XML name: CTD_TSIRSTShuntImpedance
in SKOS Concept Scheme: TSICompliances
RINF index: 1.1.1.3.7.23
created: 2021-08-08
modified: 2023-03-14
comment: TSI compliance of rules on combination of RST characteristics influencing shunting impedance. Deprecated according to the ammendment to the Regulation (EU) 2019/777.
domain: Train Detection System
range: Concept
deprecated: true
term status: stable

TSI Compliance of rules on sand characteristics
type: ObjectProperty
XML name: CTD_TSISandCharacteristics
in SKOS Concept Scheme: TSICompliances
RINF index: 1.1.1.3.7.19
created: 2021-08-08
modified: 2023-03-14
comment: TSI Compliance of rules on sand characteristics. Deprecated according to the ammendment to the Regulation (EU) 2019/777.
domain: Train Detection System
range: Concept
deprecated: true
term status: stable

TSI compliance of sanding
type: ObjectProperty
in SKOS Concept Scheme: TSICompliances
RINF index: 1.1.1.3.7.16
created: 2021-08-08
modified: 2023-03-14
comment: TSI compliance of sanding rules to allow compatibility with track circuits. Too much sand brings the risk of not detecting trains in tracks equipped with track circuits. Deprecated according to the ammendment to the Regulation (EU) 2019/777.
domain: Train Detection System
range: Concept
deprecated: true
term status: unstable

TSI compliance of rules on shunt assisting devices
type: ObjectProperty
XML name: CTD_TSIShuntDevices
in SKOS Concept Scheme: TSICompliances
RINF index: 1.1.1.3.7.22
created: 2021-08-08
modified: 2023-03-14
comment: Deprecated according to the ammendment to the Regulation (EU) 2019/777. TSI compliance of rules on shunt assisting devices.
domain: Train Detection System
range: Concept
deprecated: true
term status: stable

Existence and TSI compliance of rules for magnetic fields emitted by a vehicle
type: DatatypeProperty
XML name: CEI_TSIMagneticFields
RINF index: 1.1.1.3.9.1
RINF index: 1.2.1.1.8.1
created: 2024-04-18
source: index077 - ERA ERTMS 033281 v5.pdf
comment: Indication whether rules exist and are compliant with the TSI.
domain: CCS Subsystem
range: boolean
term status: stable

accepted TSI compliant pantograph heads
type: ObjectProperty
XML name: EPA_TSIHeads
in SKOS Concept Scheme: CompliantPantographHeads
RINF index: 1.1.1.2.3.1
used in RCC calculations: true
created: 2020-08-25
modified: 2021-09-11
comment: Indication of TSI compliant pantograph heads which are allowed to be used. The allowed values for this property belong to the SKOS Concept Scheme http://data.europa.eu/949/concepts/compliant-pantograph-heads/CompliantPantographHeads.
domain: Energy Subsystem
range: Concept
term status: stable

TSI compliance of in service values for switches and crossings
type: DatatypeProperty
XML name: ISC_TSISwitchCrossing
RINF index: 1.1.1.1.5.1
created: 2021-08-03
modified: 2021-09-10
comment: Switches and crossings are maintained to in service limit dimension as specified in TSI.
domain: Infra Subsystem
range: boolean
term status: stable

Existence and TSI compliance of limits in harmonics in the traction current of vehicles
type: DatatypeProperty
XML name: CEI_TSITractionHarmonics
RINF index: 1.1.1.3.9.2
RINF index: 1.2.1.1.8.2
created: 2024-04-18
comment: Indication whether rules exist and are compliant with the TSI.
domain: CCS Subsystem
range: boolean
term status: stable

Document available from the IM with precise description of the tunnel
type: ObjectProperty
XML name: ITU_TunnelDocRef
RINF index: 1.1.1.1.8.8.2
created: 2021-08-03
modified: 2024-01-08
modified: 2024-04-23
comment: Electronic document available from the IM stored by the Agency with precise description of the clearance gauge and geometry of the tunnel.
domain: Infra Subsystem
range: ERA Document
term status: stable
change note: Change from datatype property to object property in order to point to the class Document (reference document)

Tunnel identification
type: DatatypeProperty
XML name: OPSidingTunnelIdentification
XML name: OPTrackTunnelIdentification
XML name: SOLTunnelIdentification
Appendix D2 index: 3.2.3
RINF index: 1.1.1.1.8.2
RINF index: 1.2.1.0.5.2
RINF index: 1.2.2.0.5.2
created: 2021-08-03
modified: 2021-09-13
source: oj
comment: Unique tunnel identification or unique number within Member State.
domain: Tunnel
range: string
sub property of: Identifier
term status: stable

End of tunnel kilometer
type: DatatypeProperty
XML name: SOLTunnelEnd
RINF index: 1.1.1.1.8.4
created: 2023-03-29
is replaced by: End of tunnel kilometer
modified: 2024-02-05
comment: Part of the End of tunnel that indicates the km of the line at the end of a tunnel. The End of tunnel is the Geographical coordinates in decimal degrees and km of the line at the end of a tunnel. The reason for deprecation is that the property is now a subproperty of lineReference in order to represent the kilometer in relation to a national railway line
domain: Infra Subsystem
range: double
deprecated: true
term status: stable

Start of tunnel kilometer
type: DatatypeProperty
XML name: SOLTunnelEnd
RINF index: 1.1.1.1.8.4
created: 2023-03-29
is replaced by: Start of tunnel kilometer
modified: 2024-02-05
comment: Part of the Start of tunnel that indicates the km of the line at the beginning of a tunnel. The Start of tunnel is the Geographical coordinates in decimal degrees and km of the line at the beginning of a tunnel. The reason for deprecation is that the property is now a subproperty of lineReference in order to represent the kilometer in relation to a national railway line
domain: Infra Subsystem
range: double
deprecated: true
term status: stable

Type version id
type: ObjectProperty
in SKOS Concept Scheme: VehicleTypeVersionIds
created: 2022-11-03
comment: Indicates the registrationVersion with Ids 10, 20 and 30 indicating registration according to Directive 2008/57/EC and implementing Decision 2011/665/EU, and 40 and 50 indicating registration according to regime described in Directive 2008/57/EC. The allowed values for this property belong to the SKOS Concept Scheme http://data.europa.eu/949/concepts/type-version-ids/TypeVersionIds.
domain: Vehicle Type
range: Concept
term status: stable

Type version number
type: DatatypeProperty
created: 2020-11-22
modified: 2020-11-22
comment: Serial number that identifies a vehicle type.
domain: Vehicle Type
range: string
term status: stable

Umax2 for the French network
type: DatatypeProperty
XML name: ECS_Umax2
RINF index: 1.1.1.2.2.1.3
Unit of measure: http://qudt.org/vocab/unit/V
used in RCC calculations: true
created: 2020-08-24
modified: 2024-01-08
comment: Highest non-permanent voltage (Umax2) for France on lines not compliant with values defined in the the specification referenced in Appendix A-2, index [1].
domain: Contact Line System
range: integer
term status: stable

Unit of measure
type: AnnotationProperty
created: 2024-05-16
comment: Magnitude of a quantity, defined and adopted by convention or by law, that is used as a standard for measurement of the same kind of quantity.

Unique OP ID
type: DatatypeProperty
XML name: UniqueOPID
Appendix D2 index: 2.2.2
RINF index: 1.2.0.0.0.2
created: 2020-07-29
modified: 2024-01-08
source: oj
comment: Code composed of country code and alphanumeric operational point code.
domain: Operational Point
range: string
sub property of: Identifier
term status: stable

Parameter is used in Route Compatibility Check (RCC) calculations
type: AnnotationProperty
created: 2023-04-12
comment: Indicates whether a RINF parameter is used in Route Compatibility Check calculations according to Commission Implementing Regulation (EU) 2019/773 of 16 May 2019 on the technical specification for interoperability relating to the operation and traffic management subsystem of the rail system within the European Union and repealing Decision. https://eur-lex.europa.eu/eli/reg_impl/2019/773/oj#:~:text=Commission%20Implementing%20Regulation.
range: boolean

GSM-R use of group 555
type: DatatypeProperty
type: FunctionalProperty
XML name: CRG_Needof555
ERATV index: 4.13.2.12
RINF index: 1.1.1.3.3.4
RINF index: 1.2.1.1.2.4
used in RCC calculations: true
created: 2020-08-31
modified: 2021-09-12
modified: 2024-04-18
relation: ETCS level
requires: GSM-R (parameter 1.1.1.3.3.1) and ETCS L2 (parameter 1.1.1.3.2.1) must be installed for this parameter to be applicable.
comment: Indication if group 555 is used.
domain: CCS Subsystem
range: boolean
term status: stable

V_NVALLOWOVTRP
type: DatatypeProperty
type: FunctionalProperty
XML name: CPE_VNVALLOWOVTRP
Appendix D3 index: 1.5.3
RINF index: 1.1.1.3.2.16.3
RINF index: 1.2.1.1.1.16.3
Unit of measure: KiloM-PER-HR
created: 2022-11-07
modified: 2023-03-14
requires: Only applicable when selected value for 1.1.1.3.2.1 (ETCS present).
source: oj
comment: Speed limit allowing the driver to select the “override” function in km/h. Format: [NNF], with N a decimal number (0÷9), F=(0|5), max. `600`. See: TSI CCS (Subset-026, Chapter 7. 7.5.1.161)
domain: CCS Subsystem
range: integer
term status: stable

V_NVSUPOVTRP
type: DatatypeProperty
type: FunctionalProperty
XML name: CPE_VNVSUPOVTRP
Appendix D3 index: 1.5.4
RINF index: 1.1.1.3.2.16.4
RINF index: 1.2.1.1.1.16.4
Unit of measure: KiloM-PER-HR
created: 2022-11-07
modified: 2023-03-14
requires: Only applicable when selected value for 1.1.1.3.2.1 (ETCS present).
source: oj
comment: Override speed limit to be supervised when the “override” function is active in km/h. Format: [NNF], with N a decimal number (0÷9), F=(0|5), max. `600`. See: TSI CCS (Subset-026, chapter 7. 7.5.1.163 V_NVSUPOVTRP)
domain: CCS Subsystem
range: integer
term status: stable

validity
type: ObjectProperty
domain: Class
  union of: ERA Feature
  union of: Topological Object
range: Temporal Feature

Validity end date
type: DatatypeProperty
created: 2022-10-19
comment: TODO review: Defines the validity end date (e.g., an operational point that is not valid anymore), so that it is possible to filter out those that are not applicable for a specific application (e.g., for route planning)
domain: Infrastructure object
range: date
deprecated: true
term status: stable
scope note: To be deprecated with the introduction of temporal entity

Validity start date
type: DatatypeProperty
created: 2022-10-20
comment: TODO review: Defines the validity start date (e.g., an operational point that is not valid now since it is planned for the future), so that it is possible to filter out those that are not applicable for a specific application (e.g., for route planning)
domain: Infrastructure object
range: date
deprecated: true
term status: stable
scope note: To be deprecated with the introduction of temporal entity

Vehicle contact force
type: DatatypeProperty
ERATV index: 4.10.15
created: 2020-08-25
modified: 2020-11-03
comment: Mean contact force.
domain: Vehicle Type
range: integer
term status: stable

vehicle keeper
type: ObjectProperty
created: 2020-11-23
modified: 2020-11-23
modified: 2024-06-03
comment: Indicates the organization that owns/operated a vehicle or wagon.
domain: Vehicle
range: Body
term status: stable

Vehicle kinematic gauge other
type: DatatypeProperty
ERATV index: 4.2.2
created: 2022-05-30
comment: Vehicle kinematic gauge that corresponds to other gauges assessed using the kinematic method
domain: Vehicle Type
range: string
term status: stable

Vehicle max sanding output
type: DatatypeProperty
ERATV index: 4.14.2.13
created: 2021-09-01
modified: 2021-09-01
comment: Vehicle Maximum sanding output, given in grams per second.
domain: Vehicle Type
range: string
term status: stable

Vehicle number
type: DatatypeProperty
created: 2020-11-24
modified: 2020-11-24
comment: Identification number of a vehicle or wagon.
domain: Vehicle
range: string
term status: stable

Vehicle pantograph head
type: DatatypeProperty
ERATV index: 4.10.6
created: 2020-08-25
modified: 2020-11-03
comment: Pantograph head geometry (to be indicated for each energy supply system the vehicle is equipped for).
domain: Vehicle Type
range: string
term status: stable

Vehicle series
type: DatatypeProperty
created: 2020-11-22
modified: 2020-11-22
comment: Manufacturing series of a vehicle.
domain: Vehicle
range: string
term status: unstable

Vehicle type
type: ObjectProperty
created: 2020-11-22
modified: 2020-11-22
comment: Indicates the vehicle type of a specific vehicle or wagon.
domain: Vehicle
range: Vehicle Type
term status: stable

Vehicle type maximum cant deficiency
type: DatatypeProperty
ERATV index: 4.6.4
created: 2023-04-05
comment: Part of the combination of maximum speed and maximum cant deficiency for which the vehicle was assessed. Corresponds to the maximum cant deficiency.
domain: Maximum speed and cant deficiency
range: integer
term status: stable

Vehicle type maximum speed
type: DatatypeProperty
ERATV index: 4.6.4
created: 2023-04-05
comment: Part of the combination of maximum speed and maximum cant deficiency for which the vehicle was assessed. Corresponds to the maximum speed.
domain: Maximum speed and cant deficiency
range: integer
term status: stable

Vehicle type maximum speed and cant deficiency
type: ObjectProperty
ERATV index: 4.6.4
created: 2023-04-05
comment: Relates the vehicle type with its values of maximum speed and cant deficiency.
domain: Vehicle Type
range: Maximum speed and cant deficiency
term status: stable

List of vehicle types already identified as compatible with Traffic load and load carrying capacity of infrastructure and train detection systems
type: DatatypeProperty
RINF index: 1.1.1.5.1
created: 2023-03-14
comment: TODO: review. The infrastructure managers shall provide through RINF the information to the RU regarding list of vehicle types compatible with the route for which they have already verified compatibility for parameter Traffic load and load carrying capacity of infrastructure and train detection systems, where such information is available.
domain: Technical Characteristics
range: anyURI
term status: unstable

List of vehicles already identified as compatible with Traffic load and load carrying capacity of infrastructure and train detection systems
type: DatatypeProperty
RINF index: 1.1.1.5.2
created: 2023-03-14
comment: TODO: review. The infrastructure managers shall provide through RINF the information or a document to the RU regarding list of vehicle(s) compatible with the route for which they have already verified compatibility for parameter Traffic load and load carrying capacity of infrastructure and train detection systems, where such information is available.
domain: Technical Characteristics
range: anyURI
term status: unstable

Vehicles composing fixed formation
type: DatatypeProperty
ERATV index: 4.1.12
created: 2021-08-25
modified: 2021-08-25
comment: Number of vehicles composing the fixed formation (for fixed formation only). Note: the value is mandatory for all vehicle categories. If the vehicle is composed of only one car, the indicated value shall be '1'.
domain: Vehicle Type
range: integer
term status: stable

EC declaration of verification for track relating to compliance with the requirements from TSIs applicable to control, command signalling subsystem
type: DatatypeProperty
XML name: CDE_ECVerification
RINF index: 1.1.1.3.1.1
created: 2021-08-08
modified: 2024-01-08
comment: Unique number for EC declarations in accordance with Commission Implementing Regulation (EU) 2019/250
domain: CCS Subsystem
range: string
term status: stable

EC declaration of verification for track relating to compliance with the requirements from TSIs applicable to energy subsystem
type: DatatypeProperty
XML name: EDE_ECVerification
RINF index: 1.1.1.2.1.1
created: 2021-08-08
modified: 2024-01-08
comment: Unique number for EC declarations in accordance with Commission Implementing Regulation (EU) 2019/250.
domain: Energy Subsystem
range: string
term status: stable

EC declaration of verification for track relating to compliance with the requirements from TSIs applicable to infrastructure subsystem
type: DatatypeProperty
XML name: IDE_ECVerification
RINF index: 1.1.1.1.1.1
RINF index: 1.2.1.0.1.1
RINF index: 1.2.2.0.1.1
created: 2021-08-03
modified: 2024-01-08
comment: Unique number for EC declarations in accordance with Commission Implementing Regulation (EU) 2019/250. In https://eur-lex.europa.eu/legal-content/EN/TXT/HTML/?uri=CELEX:32019R0777&from=EN.
domain: Infra Subsystem
range: string
term status: stable

EC declaration of verification relating to compliance with the requirements from TSIs applicable to railway tunnel
type: DatatypeProperty
XML name: ITU_ECVerification
RINF index: 1.1.1.1.8.5
RINF index: 1.2.1.0.5.3
RINF index: 1.2.2.0.5.3
created: 2021-08-03
modified: 2024-01-08
comment: Unique number for EC declarations in accordance with Commission Implementing Regulation (EU) 2019/250.
domain: Infra Subsystem
range: string
term status: stable

Voice GSM-R network
type: ObjectProperty
ERATV index: 4.13.2.10
in SKOS Concept Scheme: GSMRNetworks
created: 2020-08-31
modified: 2021-08-02
comment: Voice SIM Card GSM-R Home Network. The allowed values for this property belong to the SKOS Concept Scheme http://data.europa.eu/949/concepts/gsmr-networks/GSMRNetworks
domain: Vehicle Type
range: Concept
term status: stable

Voice operational communication implementation
type: DatatypeProperty
ERATV index: 4.13.2.6
created: 2021-08-31
modified: 2021-08-31
comment: Voice and operational communication implementation.
domain: Vehicle Type
range: string
term status: stable

Radio system compatibility voice
type: ObjectProperty
XML name: CRG_RadioCompVoice
ERATV index: 4.13.2.5
in SKOS Concept Scheme: RadioSystemCompatibilitiesVoice
RINF index: 1.1.1.3.3.9
RINF index: 1.2.1.1.2.9
created: 2020-08-31
modified: 2021-09-12
modified: 2024-04-18
requires: GSM-R (parameter 1.1.1.3.3.1) must be installed for this parameter to be applicable. In case of RSC-EU-0 or None, no other values are allowed.
source: esc-rsc technical document en.pdf
comment: Radio requirements used for demonstrating technical compatibility voice. The allowed values for this property belong to the SKOS Concept Scheme http://data.europa.eu/949/concepts/voice-radio-system-compatibilities/VoiceRadioSystemCompatibilities. This concept scheme is temporatily non-deferenceable. Information on RSC voice requirements per country: https://www.era.europa.eu/era-folder/radio-system-compatibility-rsc-voice-and-data-documents
domain: Class
  union of: CCS Subsystem
  union of: Vehicle Type
range: Concept
term status: stable

weight
type: DatatypeProperty
comment: The weight of the edge between 2 topological nodes. The value of the weight is represented by the length of the functional representation of the linear element defined by the property era:from of the era:LinearElementLink. For example: :x rdf:type eraLinearElementLink; era:from :le1; era:to :le2; era:weight "1.234"^^xsd:double; #length of the track topologically represented as :le1
domain: Linear Element Link
range: double
sub property of: topDataProperty

Nominal track gauge
type: ObjectProperty
XML name: ITP_NomGauge
ERATV index: 4.1.3
in SKOS Concept Scheme: NominalTrackGauges
RINF index: 1.1.1.1.4.1
RINF index: 1.2.1.0.4.1
used in RCC calculations: true
created: 2020-07-29
modified: 2024-01-08
comment: Value expressed in millimetres that identifies the track gauge. The allowed values for this property belong to the SKOS Concept Scheme http://data.europa.eu/949/concepts/nominal-track-gauges/NominalTrackGauges
domain: Class
  union of: Infra Subsystem
  union of: Vehicle Type
range: Concept
term status: stable

Wheelset gauge changeover facility
type: ObjectProperty
ERATV index: 4.1.11
in SKOS Concept Scheme: GaugeChangeoverFacilities
created: 2020-09-01
modified: 2021-08-25
comment: Wheelset gauge changeover facility. The allowed values for this property belong to the SKOS Concept Scheme http://data.europa.eu/949/concepts/gauge-changeover-facilities/GaugeChangeoverFacilities
domain: Vehicle Type
range: Concept
term status: stable

Wheel set gauge transformation method
type: DatatypeProperty
ERATV index: 4.1.3.b
created: 2021-08-25
modified: 2021-08-25
comment: Wheel gauge transformation method. Defined if more than one wheel gauges have been selected.
domain: Vehicle Type
range: string
term status: stable

Wheelchair sleeping spaces
type: DatatypeProperty
ERATV index: 4.12.2.4
created: 2021-08-31
modified: 2021-08-31
comment: Number of wheelchair accessible sleeping places.
domain: Vehicle Type
range: string
term status: stable

Wheelchair spaces
type: DatatypeProperty
ERATV index: 4.12.2.2
created: 2021-08-31
modified: 2023-01-23
comment: Number of wheelchair spaces.
domain: Vehicle Type
range: integer
term status: stable

Identifier
type: DatatypeProperty
description: Recommended practice is to identify the resource by means of a string conforming to an identification system. Examples include International Standard Book Number (ISBN), Digital Object Identifier (DOI), and Uniform Resource Name (URN). Persistent identifiers should be provided as HTTP URIs.
comment: An unambiguous reference to the resource within a given context.
range: Literal

asWKT
type: DatatypeProperty
XML name: OPGeographicLocation
Appendix D2 index: 2.1.1
Appendix D2 index: 2.1.2
Appendix D2 index: 2.2.2
RINF index: 1.1.0.0.1.1
RINF index: 1.1.1.0.1.1
RINF index: 1.1.1.3.14.5
RINF index: 1.2.0.0.0.5
RINF index: 1.2.1.0.8.5
contributor: Matthew Perry
creator: OGC GeoSPARQL 1.0 Standard Working Group
date: 2011-06-16
description: The WKT serialization of a geometry
domain: Geometry
range: wktLiteral
sub property of: hasSerialization

hasGeometry
type: ObjectProperty
XML name: OPGeographicLocation
RINF index: 1.1.0.0.1.1
RINF index: 1.1.1.0.1.1
RINF index: 1.1.1.3.14.5
RINF index: 1.2.0.0.0.5
RINF index: 1.2.1.0.8.5
used in RCC calculations: true
contributor: Matthew Perry
creator: OGC GeoSPARQL 1.0 Standard Working Group
date: 2011-06-16
description: A spatial representation for a given feature.
domain: Feature
range: Geometry

WGS84 Geo Positioning: an RDF vocabulary
date: $Date: 2009/04/20 15:00:30 $
description: A vocabulary for representing latitude, longitude and altitude information in the WGS84 geodetic reference datum. Version $Id: wgs84_pos.rdf,v 1.22 2009/04/20 15:00:30 timbl Exp $. See http://www.w3.org/2003/01/geo/ for more details.
comment: Recent changes to this namespace: $Log: wgs84_pos.rdf,v $ Revision 1.22 2009/04/20 15:00:30 timbl Remove the time bits which have been deal with elsewhere eg in iCal. Revision 1.21 2009/04/20 12:52:47 timbl try again Revision 1.20 2009/04/20 12:42:11 timbl Add Event (edited ages ago and never checked in), and location (following discussion http://chatlogs.planetrdf.com/swig/2009-04-20#T12-36-09) Revision 1.19 2009/04/20 12:36:31 timbl Add Event (edited ages ago and never checked in), and location (following discussion http://chatlogs.planetrdf.com/swig/2009-04-20#T12-36-09) Revision 1.18 2006/02/01 22:01:04 danbri Clarified that lat and long are decimal degrees, and that alt is decimal metres about local reference ellipsoid Revision 1.17 2004/02/06 17:38:12 danbri Fixed a bad commit screwup Revision 1.15 2003/04/19 11:24:08 danbri Fixed the typo even more. Revision 1.14 2003/04/19 11:16:56 danbri fixed a typo Revision 1.13 2003/02/19 22:27:27 connolly relaxed domain constraints on lat/long/alt from Point to SpatialThing Revision 1.12 2003/01/12 01:41:41 danbri Trying local copy of XSLT doc. Revision 1.11 2003/01/12 01:20:18 danbri added a link to morten's xslt rdfs viewer. Revision 1.10 2003/01/11 18:56:49 danbri Removed datatype range from lat and long properties, since they would have required each occurance of the property to mention the datatype. Revision 1.9 2003/01/11 11:41:31 danbri Another typo; repaired rdfs:Property to rdf:Property x4 Revision 1.8 2003/01/11 11:05:02 danbri Added an rdfs:range for each lat/long/alt property, http://www.w3.org/2001/XMLSchema#float Revision 1.7 2003/01/10 20:25:16 danbri Longer rdfs:comment for Point, trying to be Earth-centric and neutral about coordinate system(s) at the same time. Feedback welcomed. Revision 1.6 2003/01/10 20:18:30 danbri Added CVS log comments into the RDF/XML as an rdfs:comment property of the vocabulary. Note that this is not common practice (but seems both harmless and potentially useful). revision 1.…
label: geo

Point
type: Class
comment: Uniquely identified by lat/long/alt. i.e. spaciallyIntersects(P1, P2) :- lat(P1, LAT), long(P1, LONG), alt(P1, ALT), lat(P2, LAT), long(P2, LONG), alt(P2, ALT). sameThing(P1, P2) :- type(P1, Point), type(P2, Point), spaciallyIntersects(P1, P2).
comment: A point, typically described using a coordinate system relative to Earth, such as WGS84.
subclass of: SpatialThing

SpatialThing
type: Class
comment: Anything with spatial extent, i.e. size, shape, or position. e.g. people, places, bowling balls, as well as abstract areas like cubes.

altitude
type: AnnotationProperty
comment: The WGS84 altitude of a SpatialThing (decimal meters above the local reference ellipsoid).
domain: SpatialThing

latitude
type: AnnotationProperty
comment: The WGS84 latitude of a SpatialThing (decimal degrees).
domain: SpatialThing

Lat/long
comment: A comma-separated representation of a latitude, longitude coordinate.

Location
type: AnnotationProperty
type: ObjectProperty
RINF index: 1.1.0.0.1.1
RINF index: 1.1.1.0.1.1
RINF index: 1.1.1.3.14.5
RINF index: 1.2.0.0.0.5
RINF index: 1.2.1.0.8.5
used in RCC calculations: true
comment: The relation between something and the point, or other geometrical thing in space, where it is. For example, the realtionship between a radio tower and a Point with a given lat and long. Or a relationship between a park and its outline as a closed arc of points, or a road and its location as a arc (a sequence of points). Clearly in practice there will be limit to the accuracy of any such statement, but one would expect an accuracy appropriate for the size of the object and uses such as mapping .
range: SpatialThing
sub property of: based near

longitude
type: AnnotationProperty
comment: The WGS84 longitude of a SpatialThing (decimal degrees).
domain: SpatialThing

Concept
type: Class
disjoint with: ConceptScheme
definition: An idea or notion; a unit of thought.

Organization
type: Class
comment: Grupo de personas que se organiza en una comunidad u otro tipo de estructura social, comercial o política. Dicho grupo tiene un objetivo o motivo común para su existencia que va más allá del conjunto de personas que lo forman y que puede actuar como “agente”. A menudo las organizaciones se pueden agrupar en estructuras jerárquicas. Se recomienda el uso de etiquetas de SKOS para denominar a cada “organización”. En concreto, `<http://www.w3.org/2004/02/skos/core#prefLabel>` para la denominación principal o recomendada (aquella reconocida legalmente, siempre que sea posible), `<http://www.w3.org/2004/02/skos/core#altLabel>` para denominaciones alternativas (nombre comercial, sigla, denominación por la que se conoce a la organización coloquialmente) y `skos:notation` para referirse al código que identifique a la organización en una lista de códigos. Denominaciones alternativas: _colectivo_ _corporación_ _grupo_ @es
comment: Rappresenta una collezione di persone organizzate all'interno di una communità o di una qualche struttura sociale, commerciale o politica. Il gruppo condivide un obiettivo o una ragione d'essere che va oltre gli stessi membri appartenenti al gruppo e può agire come un Agent. Le organizzazioni si possono spesso suddividere in strutture gerarchiche. Si raccomanda di usare le label per l'Organization mediante le proprietà di SKOS. In particolare, `<http://www.w3.org/2004/02/skos/core#prefLabel>` per il nome principale (possibilmente un nome legalmente riconosciuto)”, `<http://www.w3.org/2004/02/skos/core#altLabel>` come nome alternativo (denominazione commerciale, denominazione colloquiale) e `skos:notation` per indicare un codice di una lista di codici. @it
comment: Represents a collection of people organized together into a community or other social, commercial or political structure. The group has some common purpose or reason for existence which goes beyond the set of people belonging to it and can act as an Agent. Organizations are often decomposable into hierarchical structures. It is recommended that SKOS lexical labels should be used to label the Organization. In particular `<http://www.w3.org/2004/02/skos/core#prefLabel>` for the primary (possibly legally recognized name), `<http://www.w3.org/2004/02/skos/core#altLabel>` for alternative names (trading names, colloquial names) and `skos:notation` to denote a code from a code list. Alternative names: _Collective_ _Body_ _Org_ _Group_
comment: Représente un groupe de personnes organisées en communauté où tout autre forme de structure sociale, commerciale ou politique. Le groupe a un but commun ou une raison d'être qui va au-delà de la somme des personnes qui en font partie et peut agir en tant que "Agent". Les organisations sont souvent décomposables en structures hiérarchisées. Il est recommandé que des labels lexicaux SKOS soient utilisés pour nommer l'Organisation. En particulier `<http://www.w3.org/2004/02/skos/core#prefLabel>` pour le nom principal (en général le nom légal), `<http://www.w3.org/2004/02/skos/core#altLabel>` pour les noms alternatifs (marques, sigles, appellations familières) et `skos:notation` pour indiquer un code provenant d'une liste de code. @fr
comment: コミュニティー、その他の社会、商業、政治的な構造に共に編入された人々の集合を表わします。グループには、そこに属する人々を超えた、存在に対するある共通の目的や理由があり、エージェント（代理）を務めることができます。組織は、多くの場合、階層構造に分割できます。 @ja
label: Organisation @fr
label: Organizzazione @it
label: organización @es
subclass of: Agent

identifier
type: DatatypeProperty
comment: Código o identificador, como por ejemplo el CIF de una empresa, que permite identificar de forma inequívoca a una organización. Existen muchos códigos de identificación tanto nacionales como internacionales. Esta ontología no obliga al uso de ningún esquema en concreto. Los códigos de identificación utilizados en cada caso se deberían indicar mediante el uso de la propiedad “datatype” del valor del identificador. El uso de la propiedad “datatype” para especificar el esquema de notación utilizado está en consonancia con las buenas prácticas recomendadas para el uso de la propiedad `skos:notation`, de la que esta propiedad es una especialización. @es
comment: Donne un identifiant, comme par exemple le numéro d'enregistrement d'une entreprise, qui peut être utilisé comme identifiant unique pour l'Organisation. De nombreux schémas nationaux et internationaux sont disponibles. Cette ontologie reste neutre par rapport au schéma utilisé. Le schéma particulier utilisé devrait être indiqué par le `datatype` de la valeur de l'identifiant. Utiliser les datatypes pour distinguer les schémas de notation est cohérent avec les bonnes pratiques pour `skos:notation` dont cette propriété est une spécialisation. @fr
comment: Gives an identifier, such as a company registration number, that can be used to used to uniquely identify the organization. Many different national and international identier schemes are available. The org ontology is neutral to which schemes are used. The particular identifier scheme should be indicated by the datatype of the identifier value. Using datatypes to distinguish the notation scheme used is consistent with recommended best practice for `skos:notation` of which this property is a specialization.
comment: Indica un identificatore univoco per l'organizzazione, come ad esempio la partita IVA di un'azienda. Molti schemi di identificazione a livello nazionale e internazionale sono disponibili allo scopo. L'ontologia ORG è neutrale rispetto allo schema da utilizzare. Lo schema di identificazione dovrebbe essere indicato dal datatype del valore dell'identificatore. L'uso del datatype per distinguere lo schema di identificazione è coerente con le best practice per `skos:notation`, di cui questa proprietà è una specializzazione. @it
comment: 組織を一意に識別するために使用できる会社登録番号などの識別子を与えます。 @ja
domain: Organization
label: identifiant @fr
label: identificatore @it
label: tiene identificador @es
sub property of: notation

Document
type: Class
comment: A document.
disjoint with: Organization
disjoint with: Project
term status: stable

Person
type: Class
comment: A person.
subclass of: Agent
term status: stable

name
type: DatatypeProperty
comment: A name for some thing.
domain: Thing
range: Literal
term status: testing

nickname
type: DatatypeProperty
comment: A short informal nickname characterising an agent (includes login identifiers, IRC and other chat nicknames).
term status: testing